Full Build Summary: https://kernelci.org/build/stable-rc/branch/linux-4.9.y/kernel/v4.9.71-120-gfab37710db8b/ |
Tree: stable-rc |
Branch: linux-4.9.y |
Git Describe: v4.9.71-120-gfab37710db8b |
Git Commit: fab37710db8b0bc1a32e0b3a6ca43b4c9ff479f8 |
Git URL: http://git.kernel.org/pub/scm/linux/kernel/git/stable/linux-stable-rc.git |
Built: 4 unique architectures |
Build Failures Detected:
Errors Detected:
Errors summary: | |
---|---|
179 | include/linux/sched.h:1479:35: error: field 'arch' has incomplete type |
Detailed per-defconfig build reports:
acs5k_defconfig (arm) — FAIL, 1 error, 0 warnings, 0 section mismatches
Errors: |
---|
include/linux/sched.h:1479:35: error: field 'arch' has incomplete type |
acs5k_tiny_defconfig (arm) — FAIL, 1 error, 0 warnings, 0 section mismatches
Errors: |
---|
include/linux/sched.h:1479:35: error: field 'arch' has incomplete type |
allnoconfig (mips) — FAIL, 1 error, 0 warnings, 0 section mismatches
Errors: |
---|
include/linux/sched.h:1479:35: error: field 'arch' has incomplete type |
allnoconfig (arm64) — FAIL, 1 error, 0 warnings, 0 section mismatches
Errors: |
---|
include/linux/sched.h:1479:35: error: field 'arch' has incomplete type |
allnoconfig (x86) — PASS, 0 errors, 0 warnings, 0 section mismatches
allnoconfig (arm) — FAIL, 1 error, 0 warnings, 0 section mismatches
Errors: |
---|
include/linux/sched.h:1479:35: error: field 'arch' has incomplete type |
am200epdkit_defconfig (arm) — FAIL, 1 error, 0 warnings, 0 section mismatches
Errors: |
---|
include/linux/sched.h:1479:35: error: field 'arch' has incomplete type |
ar7_defconfig (mips) — FAIL, 1 error, 0 warnings, 0 section mismatches
Errors: |
---|
include/linux/sched.h:1479:35: error: field 'arch' has incomplete type |
aspeed_g4_defconfig (arm) — FAIL, 1 error, 0 warnings, 0 section mismatches
Errors: |
---|
include/linux/sched.h:1479:35: error: field 'arch' has incomplete type |
aspeed_g5_defconfig (arm) — FAIL, 1 error, 0 warnings, 0 section mismatches
Errors: |
---|
include/linux/sched.h:1479:35: error: field 'arch' has incomplete type |
assabet_defconfig (arm) — FAIL, 1 error, 0 warnings, 0 section mismatches
Errors: |
---|
include/linux/sched.h:1479:35: error: field 'arch' has incomplete type |
at91_dt_defconfig (arm) — FAIL, 1 error, 0 warnings, 0 section mismatches
Errors: |
---|
include/linux/sched.h:1479:35: error: field 'arch' has incomplete type |
ath25_defconfig (mips) — FAIL, 1 error, 0 warnings, 0 section mismatches
Errors: |
---|
include/linux/sched.h:1479:35: error: field 'arch' has incomplete type |
ath79_defconfig (mips) — FAIL, 1 error, 0 warnings, 0 section mismatches
Errors: |
---|
include/linux/sched.h:1479:35: error: field 'arch' has incomplete type |
axm55xx_defconfig (arm) — FAIL, 1 error, 0 warnings, 0 section mismatches
Errors: |
---|
include/linux/sched.h:1479:35: error: field 'arch' has incomplete type |
badge4_defconfig (arm) — FAIL, 1 error, 0 warnings, 0 section mismatches
Errors: |
---|
include/linux/sched.h:1479:35: error: field 'arch' has incomplete type |
bcm2835_defconfig (arm) — FAIL, 1 error, 0 warnings, 0 section mismatches
Errors: |
---|
include/linux/sched.h:1479:35: error: field 'arch' has incomplete type |
bcm47xx_defconfig (mips) — FAIL, 1 error, 0 warnings, 0 section mismatches
Errors: |
---|
include/linux/sched.h:1479:35: error: field 'arch' has incomplete type |
bcm63xx_defconfig (mips) — FAIL, 1 error, 0 warnings, 0 section mismatches
Errors: |
---|
include/linux/sched.h:1479:35: error: field 'arch' has incomplete type |
bigsur_defconfig (mips) — FAIL, 1 error, 0 warnings, 0 section mismatches
Errors: |
---|
include/linux/sched.h:1479:35: error: field 'arch' has incomplete type |
bmips_be_defconfig (mips) — FAIL, 1 error, 0 warnings, 0 section mismatches
Errors: |
---|
include/linux/sched.h:1479:35: error: field 'arch' has incomplete type |
bmips_stb_defconfig (mips) — FAIL, 1 error, 0 warnings, 0 section mismatches
Errors: |
---|
include/linux/sched.h:1479:35: error: field 'arch' has incomplete type |
capcella_defconfig (mips) — FAIL, 1 error, 0 warnings, 0 section mismatches
Errors: |
---|
include/linux/sched.h:1479:35: error: field 'arch' has incomplete type |
cavium_octeon_defconfig (mips) — FAIL, 1 error, 0 warnings, 0 section mismatches
Errors: |
---|
include/linux/sched.h:1479:35: error: field 'arch' has incomplete type |
cerfcube_defconfig (arm) — FAIL, 1 error, 0 warnings, 0 section mismatches
Errors: |
---|
include/linux/sched.h:1479:35: error: field 'arch' has incomplete type |
ci20_defconfig (mips) — FAIL, 1 error, 0 warnings, 0 section mismatches
Errors: |
---|
include/linux/sched.h:1479:35: error: field 'arch' has incomplete type |
clps711x_defconfig (arm) — FAIL, 1 error, 0 warnings, 0 section mismatches
Errors: |
---|
include/linux/sched.h:1479:35: error: field 'arch' has incomplete type |
cm_x2xx_defconfig (arm) — FAIL, 1 error, 0 warnings, 0 section mismatches
Errors: |
---|
include/linux/sched.h:1479:35: error: field 'arch' has incomplete type |
cm_x300_defconfig (arm) — FAIL, 1 error, 0 warnings, 0 section mismatches
Errors: |
---|
include/linux/sched.h:1479:35: error: field 'arch' has incomplete type |
cns3420vb_defconfig (arm) — FAIL, 1 error, 0 warnings, 0 section mismatches
Errors: |
---|
include/linux/sched.h:1479:35: error: field 'arch' has incomplete type |
cobalt_defconfig (mips) — FAIL, 1 error, 0 warnings, 0 section mismatches
Errors: |
---|
include/linux/sched.h:1479:35: error: field 'arch' has incomplete type |
colibri_pxa270_defconfig (arm) — FAIL, 1 error, 0 warnings, 0 section mismatches
Errors: |
---|
include/linux/sched.h:1479:35: error: field 'arch' has incomplete type |
colibri_pxa300_defconfig (arm) — FAIL, 1 error, 0 warnings, 0 section mismatches
Errors: |
---|
include/linux/sched.h:1479:35: error: field 'arch' has incomplete type |
collie_defconfig (arm) — FAIL, 1 error, 0 warnings, 0 section mismatches
Errors: |
---|
include/linux/sched.h:1479:35: error: field 'arch' has incomplete type |
corgi_defconfig (arm) — FAIL, 1 error, 0 warnings, 0 section mismatches
Errors: |
---|
include/linux/sched.h:1479:35: error: field 'arch' has incomplete type |
davinci_all_defconfig (arm) — FAIL, 1 error, 0 warnings, 0 section mismatches
Errors: |
---|
include/linux/sched.h:1479:35: error: field 'arch' has incomplete type |
db1xxx_defconfig (mips) — FAIL, 1 error, 0 warnings, 0 section mismatches
Errors: |
---|
include/linux/sched.h:1479:35: error: field 'arch' has incomplete type |
decstation_defconfig (mips) — FAIL, 1 error, 0 warnings, 0 section mismatches
Errors: |
---|
include/linux/sched.h:1479:35: error: field 'arch' has incomplete type |
defconfig (arm64) — FAIL, 1 error, 0 warnings, 0 section mismatches
Errors: |
---|
include/linux/sched.h:1479:35: error: field 'arch' has incomplete type |
dove_defconfig (arm) — FAIL, 1 error, 0 warnings, 0 section mismatches
Errors: |
---|
include/linux/sched.h:1479:35: error: field 'arch' has incomplete type |
e55_defconfig (mips) — FAIL, 1 error, 0 warnings, 0 section mismatches
Errors: |
---|
include/linux/sched.h:1479:35: error: field 'arch' has incomplete type |
ebsa110_defconfig (arm) — FAIL, 1 error, 0 warnings, 0 section mismatches
Errors: |
---|
include/linux/sched.h:1479:35: error: field 'arch' has incomplete type |
efm32_defconfig (arm) — FAIL, 1 error, 0 warnings, 0 section mismatches
Errors: |
---|
include/linux/sched.h:1479:35: error: field 'arch' has incomplete type |
em_x270_defconfig (arm) — FAIL, 1 error, 0 warnings, 0 section mismatches
Errors: |
---|
include/linux/sched.h:1479:35: error: field 'arch' has incomplete type |
ep93xx_defconfig (arm) — FAIL, 1 error, 0 warnings, 0 section mismatches
Errors: |
---|
include/linux/sched.h:1479:35: error: field 'arch' has incomplete type |
eseries_pxa_defconfig (arm) — FAIL, 1 error, 0 warnings, 0 section mismatches
Errors: |
---|
include/linux/sched.h:1479:35: error: field 'arch' has incomplete type |
exynos_defconfig (arm) — FAIL, 1 error, 0 warnings, 0 section mismatches
Errors: |
---|
include/linux/sched.h:1479:35: error: field 'arch' has incomplete type |
ezx_defconfig (arm) — FAIL, 1 error, 0 warnings, 0 section mismatches
Errors: |
---|
include/linux/sched.h:1479:35: error: field 'arch' has incomplete type |
footbridge_defconfig (arm) — FAIL, 1 error, 0 warnings, 0 section mismatches
Errors: |
---|
include/linux/sched.h:1479:35: error: field 'arch' has incomplete type |
fuloong2e_defconfig (mips) — FAIL, 1 error, 0 warnings, 0 section mismatches
Errors: |
---|
include/linux/sched.h:1479:35: error: field 'arch' has incomplete type |
generic_defconfig (mips) — FAIL, 1 error, 0 warnings, 0 section mismatches
Errors: |
---|
include/linux/sched.h:1479:35: error: field 'arch' has incomplete type |
gpr_defconfig (mips) — FAIL, 1 error, 0 warnings, 0 section mismatches
Errors: |
---|
include/linux/sched.h:1479:35: error: field 'arch' has incomplete type |
h3600_defconfig (arm) — FAIL, 1 error, 0 warnings, 0 section mismatches
Errors: |
---|
include/linux/sched.h:1479:35: error: field 'arch' has incomplete type |
h5000_defconfig (arm) — FAIL, 1 error, 0 warnings, 0 section mismatches
Errors: |
---|
include/linux/sched.h:1479:35: error: field 'arch' has incomplete type |
hackkit_defconfig (arm) — FAIL, 1 error, 0 warnings, 0 section mismatches
Errors: |
---|
include/linux/sched.h:1479:35: error: field 'arch' has incomplete type |
hisi_defconfig (arm) — FAIL, 1 error, 0 warnings, 0 section mismatches
Errors: |
---|
include/linux/sched.h:1479:35: error: field 'arch' has incomplete type |
i386_defconfig (x86) — PASS, 0 errors, 0 warnings, 0 section mismatches
imote2_defconfig (arm) — FAIL, 1 error, 0 warnings, 0 section mismatches
Errors: |
---|
include/linux/sched.h:1479:35: error: field 'arch' has incomplete type |
imx_v4_v5_defconfig (arm) — FAIL, 1 error, 0 warnings, 0 section mismatches
Errors: |
---|
include/linux/sched.h:1479:35: error: field 'arch' has incomplete type |
imx_v6_v7_defconfig (arm) — FAIL, 1 error, 0 warnings, 0 section mismatches
Errors: |
---|
include/linux/sched.h:1479:35: error: field 'arch' has incomplete type |
integrator_defconfig (arm) — FAIL, 1 error, 0 warnings, 0 section mismatches
Errors: |
---|
include/linux/sched.h:1479:35: error: field 'arch' has incomplete type |
iop13xx_defconfig (arm) — FAIL, 1 error, 0 warnings, 0 section mismatches
Errors: |
---|
include/linux/sched.h:1479:35: error: field 'arch' has incomplete type |
iop32x_defconfig (arm) — FAIL, 1 error, 0 warnings, 0 section mismatches
Errors: |
---|
include/linux/sched.h:1479:35: error: field 'arch' has incomplete type |
iop33x_defconfig (arm) — FAIL, 1 error, 0 warnings, 0 section mismatches
Errors: |
---|
include/linux/sched.h:1479:35: error: field 'arch' has incomplete type |
ip22_defconfig (mips) — FAIL, 1 error, 0 warnings, 0 section mismatches
Errors: |
---|
include/linux/sched.h:1479:35: error: field 'arch' has incomplete type |
ip27_defconfig (mips) — FAIL, 1 error, 0 warnings, 0 section mismatches
Errors: |
---|
include/linux/sched.h:1479:35: error: field 'arch' has incomplete type |
ip28_defconfig (mips) — FAIL, 1 error, 0 warnings, 0 section mismatches
Errors: |
---|
include/linux/sched.h:1479:35: error: field 'arch' has incomplete type |
ip32_defconfig (mips) — FAIL, 1 error, 0 warnings, 0 section mismatches
Errors: |
---|
include/linux/sched.h:1479:35: error: field 'arch' has incomplete type |
ixp4xx_defconfig (arm) — FAIL, 1 error, 0 warnings, 0 section mismatches
Errors: |
---|
include/linux/sched.h:1479:35: error: field 'arch' has incomplete type |
jazz_defconfig (mips) — FAIL, 1 error, 0 warnings, 0 section mismatches
Errors: |
---|
include/linux/sched.h:1479:35: error: field 'arch' has incomplete type |
jmr3927_defconfig (mips) — FAIL, 1 error, 0 warnings, 0 section mismatches
Errors: |
---|
include/linux/sched.h:1479:35: error: field 'arch' has incomplete type |
jornada720_defconfig (arm) — FAIL, 1 error, 0 warnings, 0 section mismatches
Errors: |
---|
include/linux/sched.h:1479:35: error: field 'arch' has incomplete type |
keystone_defconfig (arm) — FAIL, 1 error, 0 warnings, 0 section mismatches
Errors: |
---|
include/linux/sched.h:1479:35: error: field 'arch' has incomplete type |
ks8695_defconfig (arm) — FAIL, 1 error, 0 warnings, 0 section mismatches
Errors: |
---|
include/linux/sched.h:1479:35: error: field 'arch' has incomplete type |
lart_defconfig (arm) — FAIL, 1 error, 0 warnings, 0 section mismatches
Errors: |
---|
include/linux/sched.h:1479:35: error: field 'arch' has incomplete type |
lasat_defconfig (mips) — FAIL, 1 error, 0 warnings, 0 section mismatches
Errors: |
---|
include/linux/sched.h:1479:35: error: field 'arch' has incomplete type |
lemote2f_defconfig (mips) — FAIL, 1 error, 0 warnings, 0 section mismatches
Errors: |
---|
include/linux/sched.h:1479:35: error: field 'arch' has incomplete type |
loongson1b_defconfig (mips) — FAIL, 1 error, 0 warnings, 0 section mismatches
Errors: |
---|
include/linux/sched.h:1479:35: error: field 'arch' has incomplete type |
loongson1c_defconfig (mips) — FAIL, 1 error, 0 warnings, 0 section mismatches
Errors: |
---|
include/linux/sched.h:1479:35: error: field 'arch' has incomplete type |
loongson3_defconfig (mips) — FAIL, 1 error, 0 warnings, 0 section mismatches
Errors: |
---|
include/linux/sched.h:1479:35: error: field 'arch' has incomplete type |
lpc18xx_defconfig (arm) — FAIL, 1 error, 0 warnings, 0 section mismatches
Errors: |
---|
include/linux/sched.h:1479:35: error: field 'arch' has incomplete type |
lpc32xx_defconfig (arm) — FAIL, 1 error, 0 warnings, 0 section mismatches
Errors: |
---|
include/linux/sched.h:1479:35: error: field 'arch' has incomplete type |
lpd270_defconfig (arm) — FAIL, 1 error, 0 warnings, 0 section mismatches
Errors: |
---|
include/linux/sched.h:1479:35: error: field 'arch' has incomplete type |
lubbock_defconfig (arm) — FAIL, 1 error, 0 warnings, 0 section mismatches
Errors: |
---|
include/linux/sched.h:1479:35: error: field 'arch' has incomplete type |
magician_defconfig (arm) — FAIL, 1 error, 0 warnings, 0 section mismatches
Errors: |
---|
include/linux/sched.h:1479:35: error: field 'arch' has incomplete type |
mainstone_defconfig (arm) — FAIL, 1 error, 0 warnings, 0 section mismatches
Errors: |
---|
include/linux/sched.h:1479:35: error: field 'arch' has incomplete type |
malta_defconfig (mips) — FAIL, 1 error, 0 warnings, 0 section mismatches
Errors: |
---|
include/linux/sched.h:1479:35: error: field 'arch' has incomplete type |
malta_kvm_defconfig (mips) — FAIL, 1 error, 0 warnings, 0 section mismatches
Errors: |
---|
include/linux/sched.h:1479:35: error: field 'arch' has incomplete type |
malta_kvm_guest_defconfig (mips) — FAIL, 1 error, 0 warnings, 0 section mismatches
Errors: |
---|
include/linux/sched.h:1479:35: error: field 'arch' has incomplete type |
malta_qemu_32r6_defconfig (mips) — FAIL, 1 error, 0 warnings, 0 section mismatches
Errors: |
---|
include/linux/sched.h:1479:35: error: field 'arch' has incomplete type |
maltaaprp_defconfig (mips) — FAIL, 1 error, 0 warnings, 0 section mismatches
Errors: |
---|
include/linux/sched.h:1479:35: error: field 'arch' has incomplete type |
maltasmvp_defconfig (mips) — FAIL, 1 error, 0 warnings, 0 section mismatches
Errors: |
---|
include/linux/sched.h:1479:35: error: field 'arch' has incomplete type |
maltasmvp_eva_defconfig (mips) — FAIL, 1 error, 0 warnings, 0 section mismatches
Errors: |
---|
include/linux/sched.h:1479:35: error: field 'arch' has incomplete type |
maltaup_defconfig (mips) — FAIL, 1 error, 0 warnings, 0 section mismatches
Errors: |
---|
include/linux/sched.h:1479:35: error: field 'arch' has incomplete type |
maltaup_xpa_defconfig (mips) — FAIL, 1 error, 0 warnings, 0 section mismatches
Errors: |
---|
include/linux/sched.h:1479:35: error: field 'arch' has incomplete type |
markeins_defconfig (mips) — FAIL, 1 error, 0 warnings, 0 section mismatches
Errors: |
---|
include/linux/sched.h:1479:35: error: field 'arch' has incomplete type |
mini2440_defconfig (arm) — FAIL, 1 error, 0 warnings, 0 section mismatches
Errors: |
---|
include/linux/sched.h:1479:35: error: field 'arch' has incomplete type |
mips_paravirt_defconfig (mips) — FAIL, 1 error, 0 warnings, 0 section mismatches
Errors: |
---|
include/linux/sched.h:1479:35: error: field 'arch' has incomplete type |
mmp2_defconfig (arm) — FAIL, 1 error, 0 warnings, 0 section mismatches
Errors: |
---|
include/linux/sched.h:1479:35: error: field 'arch' has incomplete type |
moxart_defconfig (arm) — FAIL, 1 error, 0 warnings, 0 section mismatches
Errors: |
---|
include/linux/sched.h:1479:35: error: field 'arch' has incomplete type |
mpc30x_defconfig (mips) — FAIL, 1 error, 0 warnings, 0 section mismatches
Errors: |
---|
include/linux/sched.h:1479:35: error: field 'arch' has incomplete type |
mps2_defconfig (arm) — FAIL, 1 error, 0 warnings, 0 section mismatches
Errors: |
---|
include/linux/sched.h:1479:35: error: field 'arch' has incomplete type |
msp71xx_defconfig (mips) — FAIL, 1 error, 0 warnings, 0 section mismatches
Errors: |
---|
include/linux/sched.h:1479:35: error: field 'arch' has incomplete type |
mtx1_defconfig (mips) — FAIL, 1 error, 0 warnings, 0 section mismatches
Errors: |
---|
include/linux/sched.h:1479:35: error: field 'arch' has incomplete type |
multi_v4t_defconfig (arm) — FAIL, 1 error, 0 warnings, 0 section mismatches
Errors: |
---|
include/linux/sched.h:1479:35: error: field 'arch' has incomplete type |
multi_v5_defconfig (arm) — FAIL, 1 error, 0 warnings, 0 section mismatches
Errors: |
---|
include/linux/sched.h:1479:35: error: field 'arch' has incomplete type |
multi_v7_defconfig (arm) — FAIL, 1 error, 0 warnings, 0 section mismatches
Errors: |
---|
include/linux/sched.h:1479:35: error: field 'arch' has incomplete type |
mv78xx0_defconfig (arm) — FAIL, 1 error, 0 warnings, 0 section mismatches
Errors: |
---|
include/linux/sched.h:1479:35: error: field 'arch' has incomplete type |
mvebu_v5_defconfig (arm) — FAIL, 1 error, 0 warnings, 0 section mismatches
Errors: |
---|
include/linux/sched.h:1479:35: error: field 'arch' has incomplete type |
mvebu_v7_defconfig (arm) — FAIL, 1 error, 0 warnings, 0 section mismatches
Errors: |
---|
include/linux/sched.h:1479:35: error: field 'arch' has incomplete type |
mxs_defconfig (arm) — FAIL, 1 error, 0 warnings, 0 section mismatches
Errors: |
---|
include/linux/sched.h:1479:35: error: field 'arch' has incomplete type |
neponset_defconfig (arm) — FAIL, 1 error, 0 warnings, 0 section mismatches
Errors: |
---|
include/linux/sched.h:1479:35: error: field 'arch' has incomplete type |
netwinder_defconfig (arm) — FAIL, 1 error, 0 warnings, 0 section mismatches
Errors: |
---|
include/linux/sched.h:1479:35: error: field 'arch' has incomplete type |
netx_defconfig (arm) — FAIL, 1 error, 0 warnings, 0 section mismatches
Errors: |
---|
include/linux/sched.h:1479:35: error: field 'arch' has incomplete type |
nhk8815_defconfig (arm) — FAIL, 1 error, 0 warnings, 0 section mismatches
Errors: |
---|
include/linux/sched.h:1479:35: error: field 'arch' has incomplete type |
nlm_xlp_defconfig (mips) — FAIL, 1 error, 0 warnings, 0 section mismatches
Errors: |
---|
include/linux/sched.h:1479:35: error: field 'arch' has incomplete type |
nlm_xlr_defconfig (mips) — FAIL, 1 error, 0 warnings, 0 section mismatches
Errors: |
---|
include/linux/sched.h:1479:35: error: field 'arch' has incomplete type |
nuc910_defconfig (arm) — FAIL, 1 error, 0 warnings, 0 section mismatches
Errors: |
---|
include/linux/sched.h:1479:35: error: field 'arch' has incomplete type |
nuc950_defconfig (arm) — FAIL, 1 error, 0 warnings, 0 section mismatches
Errors: |
---|
include/linux/sched.h:1479:35: error: field 'arch' has incomplete type |
nuc960_defconfig (arm) — FAIL, 1 error, 0 warnings, 0 section mismatches
Errors: |
---|
include/linux/sched.h:1479:35: error: field 'arch' has incomplete type |
omap1_defconfig (arm) — FAIL, 1 error, 0 warnings, 0 section mismatches
Errors: |
---|
include/linux/sched.h:1479:35: error: field 'arch' has incomplete type |
omap2plus_defconfig (arm) — FAIL, 1 error, 0 warnings, 0 section mismatches
Errors: |
---|
include/linux/sched.h:1479:35: error: field 'arch' has incomplete type |
orion5x_defconfig (arm) — FAIL, 1 error, 0 warnings, 0 section mismatches
Errors: |
---|
include/linux/sched.h:1479:35: error: field 'arch' has incomplete type |
palmz72_defconfig (arm) — FAIL, 1 error, 0 warnings, 0 section mismatches
Errors: |
---|
include/linux/sched.h:1479:35: error: field 'arch' has incomplete type |
pcm027_defconfig (arm) — FAIL, 1 error, 0 warnings, 0 section mismatches
Errors: |
---|
include/linux/sched.h:1479:35: error: field 'arch' has incomplete type |
pic32mzda_defconfig (mips) — FAIL, 1 error, 0 warnings, 0 section mismatches
Errors: |
---|
include/linux/sched.h:1479:35: error: field 'arch' has incomplete type |
pistachio_defconfig (mips) — FAIL, 1 error, 0 warnings, 0 section mismatches
Errors: |
---|
include/linux/sched.h:1479:35: error: field 'arch' has incomplete type |
pleb_defconfig (arm) — FAIL, 1 error, 0 warnings, 0 section mismatches
Errors: |
---|
include/linux/sched.h:1479:35: error: field 'arch' has incomplete type |
pnx8335_stb225_defconfig (mips) — FAIL, 1 error, 0 warnings, 0 section mismatches
Errors: |
---|
include/linux/sched.h:1479:35: error: field 'arch' has incomplete type |
prima2_defconfig (arm) — FAIL, 1 error, 0 warnings, 0 section mismatches
Errors: |
---|
include/linux/sched.h:1479:35: error: field 'arch' has incomplete type |
pxa168_defconfig (arm) — FAIL, 1 error, 0 warnings, 0 section mismatches
Errors: |
---|
include/linux/sched.h:1479:35: error: field 'arch' has incomplete type |
pxa255-idp_defconfig (arm) — FAIL, 1 error, 0 warnings, 0 section mismatches
Errors: |
---|
include/linux/sched.h:1479:35: error: field 'arch' has incomplete type |
pxa3xx_defconfig (arm) — FAIL, 1 error, 0 warnings, 0 section mismatches
Errors: |
---|
include/linux/sched.h:1479:35: error: field 'arch' has incomplete type |
pxa910_defconfig (arm) — FAIL, 1 error, 0 warnings, 0 section mismatches
Errors: |
---|
include/linux/sched.h:1479:35: error: field 'arch' has incomplete type |
pxa_defconfig (arm) — FAIL, 1 error, 0 warnings, 0 section mismatches
Errors: |
---|
include/linux/sched.h:1479:35: error: field 'arch' has incomplete type |
qcom_defconfig (arm) — FAIL, 1 error, 0 warnings, 0 section mismatches
Errors: |
---|
include/linux/sched.h:1479:35: error: field 'arch' has incomplete type |
qi_lb60_defconfig (mips) — FAIL, 1 error, 0 warnings, 0 section mismatches
Errors: |
---|
include/linux/sched.h:1479:35: error: field 'arch' has incomplete type |
raumfeld_defconfig (arm) — FAIL, 1 error, 0 warnings, 0 section mismatches
Errors: |
---|
include/linux/sched.h:1479:35: error: field 'arch' has incomplete type |
rb532_defconfig (mips) — FAIL, 1 error, 0 warnings, 0 section mismatches
Errors: |
---|
include/linux/sched.h:1479:35: error: field 'arch' has incomplete type |
rbtx49xx_defconfig (mips) — FAIL, 1 error, 0 warnings, 0 section mismatches
Errors: |
---|
include/linux/sched.h:1479:35: error: field 'arch' has incomplete type |
realview_defconfig (arm) — FAIL, 1 error, 0 warnings, 0 section mismatches
Errors: |
---|
include/linux/sched.h:1479:35: error: field 'arch' has incomplete type |
rm200_defconfig (mips) — FAIL, 1 error, 0 warnings, 0 section mismatches
Errors: |
---|
include/linux/sched.h:1479:35: error: field 'arch' has incomplete type |
rpc_defconfig (arm) — FAIL, 1 error, 0 warnings, 0 section mismatches
Errors: |
---|
include/linux/sched.h:1479:35: error: field 'arch' has incomplete type |
rt305x_defconfig (mips) — FAIL, 1 error, 0 warnings, 0 section mismatches
Errors: |
---|
include/linux/sched.h:1479:35: error: field 'arch' has incomplete type |
s3c2410_defconfig (arm) — FAIL, 1 error, 0 warnings, 0 section mismatches
Errors: |
---|
include/linux/sched.h:1479:35: error: field 'arch' has incomplete type |
s3c6400_defconfig (arm) — FAIL, 1 error, 0 warnings, 0 section mismatches
Errors: |
---|
include/linux/sched.h:1479:35: error: field 'arch' has incomplete type |
s5pv210_defconfig (arm) — FAIL, 1 error, 0 warnings, 0 section mismatches
Errors: |
---|
include/linux/sched.h:1479:35: error: field 'arch' has incomplete type |
sama5_defconfig (arm) — FAIL, 1 error, 0 warnings, 0 section mismatches
Errors: |
---|
include/linux/sched.h:1479:35: error: field 'arch' has incomplete type |
sb1250_swarm_defconfig (mips) — FAIL, 1 error, 0 warnings, 0 section mismatches
Errors: |
---|
include/linux/sched.h:1479:35: error: field 'arch' has incomplete type |
shannon_defconfig (arm) — FAIL, 1 error, 0 warnings, 0 section mismatches
Errors: |
---|
include/linux/sched.h:1479:35: error: field 'arch' has incomplete type |
shmobile_defconfig (arm) — FAIL, 1 error, 0 warnings, 0 section mismatches
Errors: |
---|
include/linux/sched.h:1479:35: error: field 'arch' has incomplete type |
simpad_defconfig (arm) — FAIL, 1 error, 0 warnings, 0 section mismatches
Errors: |
---|
include/linux/sched.h:1479:35: error: field 'arch' has incomplete type |
socfpga_defconfig (arm) — FAIL, 1 error, 0 warnings, 0 section mismatches
Errors: |
---|
include/linux/sched.h:1479:35: error: field 'arch' has incomplete type |
spear13xx_defconfig (arm) — FAIL, 1 error, 0 warnings, 0 section mismatches
Errors: |
---|
include/linux/sched.h:1479:35: error: field 'arch' has incomplete type |
spear3xx_defconfig (arm) — FAIL, 1 error, 0 warnings, 0 section mismatches
Errors: |
---|
include/linux/sched.h:1479:35: error: field 'arch' has incomplete type |
spear6xx_defconfig (arm) — FAIL, 1 error, 0 warnings, 0 section mismatches
Errors: |
---|
include/linux/sched.h:1479:35: error: field 'arch' has incomplete type |
spitz_defconfig (arm) — FAIL, 1 error, 0 warnings, 0 section mismatches
Errors: |
---|
include/linux/sched.h:1479:35: error: field 'arch' has incomplete type |
stm32_defconfig (arm) — FAIL, 1 error, 0 warnings, 0 section mismatches
Errors: |
---|
include/linux/sched.h:1479:35: error: field 'arch' has incomplete type |
sunxi_defconfig (arm) — FAIL, 1 error, 0 warnings, 0 section mismatches
Errors: |
---|
include/linux/sched.h:1479:35: error: field 'arch' has incomplete type |
tb0219_defconfig (mips) — FAIL, 1 error, 0 warnings, 0 section mismatches
Errors: |
---|
include/linux/sched.h:1479:35: error: field 'arch' has incomplete type |
tb0226_defconfig (mips) — FAIL, 1 error, 0 warnings, 0 section mismatches
Errors: |
---|
include/linux/sched.h:1479:35: error: field 'arch' has incomplete type |
tb0287_defconfig (mips) — FAIL, 1 error, 0 warnings, 0 section mismatches
Errors: |
---|
include/linux/sched.h:1479:35: error: field 'arch' has incomplete type |
tct_hammer_defconfig (arm) — FAIL, 1 error, 0 warnings, 0 section mismatches
Errors: |
---|
include/linux/sched.h:1479:35: error: field 'arch' has incomplete type |
tegra_defconfig (arm) — FAIL, 1 error, 0 warnings, 0 section mismatches
Errors: |
---|
include/linux/sched.h:1479:35: error: field 'arch' has incomplete type |
tinyconfig (mips) — FAIL, 1 error, 0 warnings, 0 section mismatches
Errors: |
---|
include/linux/sched.h:1479:35: error: field 'arch' has incomplete type |
tinyconfig (arm64) — FAIL, 1 error, 0 warnings, 0 section mismatches
Errors: |
---|
include/linux/sched.h:1479:35: error: field 'arch' has incomplete type |
tinyconfig (x86) — PASS, 0 errors, 0 warnings, 0 section mismatches
tinyconfig (arm) — FAIL, 1 error, 0 warnings, 0 section mismatches
Errors: |
---|
include/linux/sched.h:1479:35: error: field 'arch' has incomplete type |
trizeps4_defconfig (arm) — FAIL, 1 error, 0 warnings, 0 section mismatches
Errors: |
---|
include/linux/sched.h:1479:35: error: field 'arch' has incomplete type |
u300_defconfig (arm) — FAIL, 1 error, 0 warnings, 0 section mismatches
Errors: |
---|
include/linux/sched.h:1479:35: error: field 'arch' has incomplete type |
u8500_defconfig (arm) — FAIL, 1 error, 0 warnings, 0 section mismatches
Errors: |
---|
include/linux/sched.h:1479:35: error: field 'arch' has incomplete type |
versatile_defconfig (arm) — FAIL, 1 error, 0 warnings, 0 section mismatches
Errors: |
---|
include/linux/sched.h:1479:35: error: field 'arch' has incomplete type |
vexpress_defconfig (arm) — FAIL, 1 error, 0 warnings, 0 section mismatches
Errors: |
---|
include/linux/sched.h:1479:35: error: field 'arch' has incomplete type |
vf610m4_defconfig (arm) — FAIL, 1 error, 0 warnings, 0 section mismatches
Errors: |
---|
include/linux/sched.h:1479:35: error: field 'arch' has incomplete type |
viper_defconfig (arm) — FAIL, 1 error, 0 warnings, 0 section mismatches
Errors: |
---|
include/linux/sched.h:1479:35: error: field 'arch' has incomplete type |
vt8500_v6_v7_defconfig (arm) — FAIL, 1 error, 0 warnings, 0 section mismatches
Errors: |
---|
include/linux/sched.h:1479:35: error: field 'arch' has incomplete type |
workpad_defconfig (mips) — FAIL, 1 error, 0 warnings, 0 section mismatches
Errors: |
---|
include/linux/sched.h:1479:35: error: field 'arch' has incomplete type |
x86_64_defconfig (x86) — PASS, 0 errors, 0 warnings, 0 section mismatches
xcep_defconfig (arm) — FAIL, 1 error, 0 warnings, 0 section mismatches
Errors: |
---|
include/linux/sched.h:1479:35: error: field 'arch' has incomplete type |
xilfpga_defconfig (mips) — FAIL, 1 error, 0 warnings, 0 section mismatches
Errors: |
---|
include/linux/sched.h:1479:35: error: field 'arch' has incomplete type |
xway_defconfig (mips) — FAIL, 1 error, 0 warnings, 0 section mismatches
Errors: |
---|
include/linux/sched.h:1479:35: error: field 'arch' has incomplete type |
zeus_defconfig (arm) — FAIL, 1 error, 0 warnings, 0 section mismatches
Errors: |
---|
include/linux/sched.h:1479:35: error: field 'arch' has incomplete type |
zx_defconfig (arm) — FAIL, 1 error, 0 warnings, 0 section mismatches
Errors: |
---|
include/linux/sched.h:1479:35: error: field 'arch' has incomplete type |