lists.linaro.org
Sign In
Sign Up
Sign In
Sign Up
Manage this list
×
Keyboard Shortcuts
Thread View
j
: Next unread message
k
: Previous unread message
j a
: Jump to all threads
j l
: Jump to MailingList overview
2025
February
January
2024
December
November
October
September
August
July
June
May
April
March
February
January
2023
December
November
October
September
August
July
June
May
April
March
February
January
2022
December
November
October
September
August
July
June
May
April
March
February
January
2021
December
November
October
September
August
July
June
May
April
March
February
January
2020
December
November
October
September
August
July
June
May
April
March
February
January
2019
December
November
October
September
August
July
June
May
April
March
February
January
2018
December
November
October
September
August
July
June
May
April
March
February
January
2017
December
November
October
September
August
July
June
May
April
March
February
January
2016
December
November
October
September
August
July
June
May
April
March
February
January
2015
December
November
October
September
August
July
June
May
April
March
February
January
2014
December
November
October
September
August
July
June
May
April
March
February
January
2013
December
November
October
September
August
July
June
May
April
March
February
January
2012
December
November
October
September
August
July
June
May
April
March
February
January
2011
December
November
October
September
August
July
June
May
April
March
February
List overview
Download
linaro-kernel
June 2014
----- 2025 -----
February 2025
January 2025
----- 2024 -----
December 2024
November 2024
October 2024
September 2024
August 2024
July 2024
June 2024
May 2024
April 2024
March 2024
February 2024
January 2024
----- 2023 -----
December 2023
November 2023
October 2023
September 2023
August 2023
July 2023
June 2023
May 2023
April 2023
March 2023
February 2023
January 2023
----- 2022 -----
December 2022
November 2022
October 2022
September 2022
August 2022
July 2022
June 2022
May 2022
April 2022
March 2022
February 2022
January 2022
----- 2021 -----
December 2021
November 2021
October 2021
September 2021
August 2021
July 2021
June 2021
May 2021
April 2021
March 2021
February 2021
January 2021
----- 2020 -----
December 2020
November 2020
October 2020
September 2020
August 2020
July 2020
June 2020
May 2020
April 2020
March 2020
February 2020
January 2020
----- 2019 -----
December 2019
November 2019
October 2019
September 2019
August 2019
July 2019
June 2019
May 2019
April 2019
March 2019
February 2019
January 2019
----- 2018 -----
December 2018
November 2018
October 2018
September 2018
August 2018
July 2018
June 2018
May 2018
April 2018
March 2018
February 2018
January 2018
----- 2017 -----
December 2017
November 2017
October 2017
September 2017
August 2017
July 2017
June 2017
May 2017
April 2017
March 2017
February 2017
January 2017
----- 2016 -----
December 2016
November 2016
October 2016
September 2016
August 2016
July 2016
June 2016
May 2016
April 2016
March 2016
February 2016
January 2016
----- 2015 -----
December 2015
November 2015
October 2015
September 2015
August 2015
July 2015
June 2015
May 2015
April 2015
March 2015
February 2015
January 2015
----- 2014 -----
December 2014
November 2014
October 2014
September 2014
August 2014
July 2014
June 2014
May 2014
April 2014
March 2014
February 2014
January 2014
----- 2013 -----
December 2013
November 2013
October 2013
September 2013
August 2013
July 2013
June 2013
May 2013
April 2013
March 2013
February 2013
January 2013
----- 2012 -----
December 2012
November 2012
October 2012
September 2012
August 2012
July 2012
June 2012
May 2012
April 2012
March 2012
February 2012
January 2012
----- 2011 -----
December 2011
November 2011
October 2011
September 2011
August 2011
July 2011
June 2011
May 2011
April 2011
March 2011
February 2011
linaro-kernel@lists.linaro.org
91 participants
222 discussions
Start a n
N
ew thread
arm-soc boot: 64 boots: 63 pass, 1 fail (v3.16-rc1-22-g6d43925)
by Kevin's boot bot
Full logs here:
http://armcloud.us/kernel-ci/arm-soc/v3.16-rc1-22-g6d43925
Tree/Branch: arm-soc Git describe: v3.16-rc1-22-g6d43925 Failed boot tests ================= ste-snowball: FAIL: arm-u8500_defconfig
http://armcloud.us/kernel-ci/arm-soc/v3.16-rc1-22-g6d43925/arm-u8500_defcon…
Full Report =========== arm-davinci_all_defconfig ------------------------- legacy,dm365evm 0 min 18.0 sec: PASS da850-evm 0 min 16.0 sec: PASS arm-tegra_defconfig ------------------- tegra124-jetson-tk1 0 min 18.4 sec: PASS tegra30-beaver 0 min 18.3 sec: PASS arm-multi_v7_defconfig+CONFIG_ARM_LPAE=y ---------------------------------------- tegra124-jetson-tk1 0 min 18.5 sec: PASS armada-xp-openblocks-ax3-4 0 min 24.4 sec: PASS omap5-uevm 1 min 44.0 sec: PASS (Warnings: 1) sun7i-a20-cubieboard2 0 min 13.3 sec: PASS arm-mvebu_v7_defconfig+CONFIG_CPU_BIG_ENDIAN=y ---------------------------------------------- armada-xp-openblocks-ax3-4 0 min 24.2 sec: PASS armada-370-mirabox 0 min 21.0 sec: PASS arm-omap2plus_defconfig ----------------------- legacy,3730xm 0 min 41.1 sec: PASS am335x-boneblack 0 min 23.0 sec: PASS omap3-beagle-xm 0 min 50.3 sec: PASS legacy,3530beagle 0 min 26.9 sec: PASS (Warnings: 1) omap4-panda 0 min 57.5 sec: PASS (Warnings: 1) omap3-overo-tobi 0 min 23.6 sec: PASS am335x-bone 0 min 24.7 sec: PASS omap3-overo-storm-tobi 0 min 24.6 sec: PASS omap5-uevm 1 min 0.6 sec: PASS (Warnings: 1) omap3-n900 0 min 16.9 sec: PASS legacy,n900 0 min 17.8 sec: PASS (Warnings: 1) omap4-panda-es 0 min 54.5 sec: PASS (Warnings: 1) legacy,3730storm 0 min 22.7 sec: PASS legacy,3530overo 0 min 21.9 sec: PASS (Warnings: 1) arm-multi_v7_defconfig ---------------------- imx6dl-wandboard,wand-solo 0 min 16.2 sec: PASS am335x-boneblack 0 min 22.6 sec: PASS sun7i-a20-cubieboard2 0 min 13.6 sec: PASS sun4i-a10-cubieboard 0 min 17.9 sec: PASS exynos5410-smdk5410 0 min 29.3 sec: PASS am335x-bone 0 min 29.2 sec: PASS tegra124-jetson-tk1 0 min 18.5 sec: PASS armada-370-mirabox 0 min 22.3 sec: PASS omap4-panda 0 min 55.5 sec: PASS (Warnings: 1) imx6q-wandboard 0 min 14.5 sec: PASS imx6dl-wandboard,wand-dual 0 min 15.9 sec: PASS ste-snowball 1 min 19.5 sec: PASS tegra30-beaver 0 min 21.0 sec: PASS omap3-n900 0 min 17.0 sec: PASS qcom-apq8074-dragonboard 0 min 18.2 sec: PASS bcm28155-ap 0 min 26.4 sec: PASS omap3-overo-tobi 0 min 23.0 sec: PASS omap3-overo-storm-tobi 0 min 20.9 sec: PASS omap3-beagle-xm 0 min 51.0 sec: PASS exynos5420-arndale-octa 1 min 11.0 sec: PASS armada-xp-openblocks-ax3-4 0 min 25.4 sec: PASS omap5-uevm 1 min 42.5 sec: PASS (Warnings: 1) omap4-panda-es 0 min 53.5 sec: PASS (Warnings: 1) exynos5250-arndale 0 min 31.8 sec: PASS arm-sunxi_defconfig ------------------- sun7i-a20-cubieboard2 0 min 12.2 sec: PASS sun4i-a10-cubieboard 0 min 12.0 sec: PASS arm-qcom_defconfig ------------------ qcom-apq8074-dragonboard 0 min 19.0 sec: PASS arm-bcm_defconfig ----------------- bcm28155-ap 0 min 23.6 sec: PASS arm-exynos_defconfig -------------------- exynos5420-arndale-octa 0 min 39.5 sec: PASS exynos5250-arndale 0 min 30.8 sec: PASS exynos5410-smdk5410 0 min 27.6 sec: PASS arm-imx_v6_v7_defconfig ----------------------- imx6dl-wandboard,wand-dual 0 min 16.4 sec: PASS imx6dl-wandboard,wand-solo 0 min 16.5 sec: PASS imx6q-wandboard 0 min 14.9 sec: PASS arm-u8500_defconfig ------------------- ste-snowball 1 min 50.3 sec: FAIL arm-multi_v7_defconfig+CONFIG_CPU_BIG_ENDIAN=y ---------------------------------------------- armada-xp-openblocks-ax3-4 0 min 27.1 sec: PASS armada-370-mirabox 0 min 23.0 sec: PASS arm-mvebu_v7_defconfig ---------------------- armada-xp-openblocks-ax3-4 0 min 22.7 sec: PASS armada-370-mirabox 0 min 20.7 sec: PASS arm-sama5_defconfig ------------------- sama5d35ek 0 min 16.1 sec: PASS (Warnings: 1)
10 years, 8 months
1
0
0
0
mainline boot: 64 boots: 62 pass, 2 fail (v3.16-rc1-330-g401c58f)
by Kevin's boot bot
Full logs here:
http://armcloud.us/kernel-ci/mainline/v3.16-rc1-330-g401c58f
Tree/Branch: mainline Git describe: v3.16-rc1-330-g401c58f Failed boot tests ================= exynos5420-arndale-octa: FAIL: arm-exynos_defconfig
http://armcloud.us/kernel-ci/mainline/v3.16-rc1-330-g401c58f/arm-exynos_def…
ste-snowball: FAIL: arm-u8500_defconfig
http://armcloud.us/kernel-ci/mainline/v3.16-rc1-330-g401c58f/arm-u8500_defc…
Full Report =========== arm-davinci_all_defconfig ------------------------- legacy,dm365evm 0 min 18.4 sec: PASS da850-evm 0 min 16.3 sec: PASS arm-tegra_defconfig ------------------- tegra124-jetson-tk1 0 min 18.6 sec: PASS tegra30-beaver 0 min 18.2 sec: PASS arm-multi_v7_defconfig+CONFIG_ARM_LPAE=y ---------------------------------------- tegra124-jetson-tk1 0 min 18.7 sec: PASS armada-xp-openblocks-ax3-4 0 min 24.6 sec: PASS omap5-uevm 1 min 40.3 sec: PASS (Warnings: 1) sun7i-a20-cubieboard2 0 min 13.4 sec: PASS arm-mvebu_v7_defconfig+CONFIG_CPU_BIG_ENDIAN=y ---------------------------------------------- armada-xp-openblocks-ax3-4 0 min 24.0 sec: PASS armada-370-mirabox 0 min 20.9 sec: PASS arm-omap2plus_defconfig ----------------------- legacy,3730xm 0 min 46.7 sec: PASS am335x-boneblack 0 min 23.0 sec: PASS omap3-beagle-xm 0 min 50.2 sec: PASS legacy,3530beagle 0 min 24.0 sec: PASS (Warnings: 1) omap4-panda 0 min 56.5 sec: PASS (Warnings: 1) omap3-overo-tobi 0 min 24.1 sec: PASS am335x-bone 0 min 24.7 sec: PASS omap3-overo-storm-tobi 0 min 25.8 sec: PASS omap5-uevm 1 min 1.3 sec: PASS (Warnings: 1) omap3-n900 0 min 17.6 sec: PASS legacy,n900 0 min 17.7 sec: PASS (Warnings: 1) omap4-panda-es 0 min 56.5 sec: PASS (Warnings: 1) legacy,3730storm 0 min 23.3 sec: PASS legacy,3530overo 0 min 22.4 sec: PASS (Warnings: 1) arm-multi_v7_defconfig ---------------------- imx6dl-wandboard,wand-solo 0 min 16.0 sec: PASS am335x-boneblack 0 min 22.6 sec: PASS sun7i-a20-cubieboard2 0 min 13.4 sec: PASS sun4i-a10-cubieboard 0 min 18.1 sec: PASS exynos5410-smdk5410 0 min 29.5 sec: PASS am335x-bone 0 min 24.3 sec: PASS tegra124-jetson-tk1 0 min 18.6 sec: PASS armada-370-mirabox 0 min 22.3 sec: PASS omap4-panda 0 min 56.0 sec: PASS (Warnings: 1) imx6q-wandboard 0 min 14.8 sec: PASS imx6dl-wandboard,wand-dual 0 min 16.1 sec: PASS ste-snowball 1 min 15.4 sec: PASS tegra30-beaver 0 min 20.6 sec: PASS omap3-n900 0 min 16.9 sec: PASS qcom-apq8074-dragonboard 0 min 20.0 sec: PASS bcm28155-ap 0 min 25.5 sec: PASS omap3-overo-tobi 0 min 22.6 sec: PASS omap3-overo-storm-tobi 0 min 24.8 sec: PASS omap3-beagle-xm 0 min 51.7 sec: PASS exynos5420-arndale-octa 0 min 40.8 sec: PASS armada-xp-openblocks-ax3-4 0 min 25.5 sec: PASS omap5-uevm 1 min 38.0 sec: PASS (Warnings: 1) omap4-panda-es 0 min 56.1 sec: PASS (Warnings: 1) exynos5250-arndale 0 min 31.9 sec: PASS arm-sunxi_defconfig ------------------- sun7i-a20-cubieboard2 0 min 12.0 sec: PASS sun4i-a10-cubieboard 0 min 12.0 sec: PASS arm-qcom_defconfig ------------------ qcom-apq8074-dragonboard 0 min 18.8 sec: PASS arm-bcm_defconfig ----------------- bcm28155-ap 0 min 22.8 sec: PASS arm-exynos_defconfig -------------------- exynos5420-arndale-octa 0 min 51.2 sec: FAIL exynos5250-arndale 0 min 34.4 sec: PASS exynos5410-smdk5410 0 min 27.7 sec: PASS arm-imx_v6_v7_defconfig ----------------------- imx6dl-wandboard,wand-dual 0 min 16.4 sec: PASS imx6dl-wandboard,wand-solo 0 min 16.4 sec: PASS imx6q-wandboard 0 min 14.9 sec: PASS arm-u8500_defconfig ------------------- ste-snowball 1 min 50.5 sec: FAIL arm-multi_v7_defconfig+CONFIG_CPU_BIG_ENDIAN=y ---------------------------------------------- armada-xp-openblocks-ax3-4 0 min 26.9 sec: PASS armada-370-mirabox 0 min 23.1 sec: PASS arm-mvebu_v7_defconfig ---------------------- armada-xp-openblocks-ax3-4 0 min 22.7 sec: PASS armada-370-mirabox 0 min 20.6 sec: PASS arm-sama5_defconfig ------------------- sama5d35ek 0 min 16.1 sec: PASS (Warnings: 1)
10 years, 8 months
1
0
0
0
mainline boot: 64 boots: 62 pass, 2 fail (v3.16-rc1-285-g7a8e9c8)
by Kevin's boot bot
Full logs here:
http://armcloud.us/kernel-ci/mainline/v3.16-rc1-285-g7a8e9c8
Tree/Branch: mainline Git describe: v3.16-rc1-285-g7a8e9c8 Failed boot tests ================= exynos5420-arndale-octa: FAIL: arm-exynos_defconfig
http://armcloud.us/kernel-ci/mainline/v3.16-rc1-285-g7a8e9c8/arm-exynos_def…
ste-snowball: FAIL: arm-u8500_defconfig
http://armcloud.us/kernel-ci/mainline/v3.16-rc1-285-g7a8e9c8/arm-u8500_defc…
Full Report =========== arm-davinci_all_defconfig ------------------------- legacy,dm365evm 0 min 18.1 sec: PASS da850-evm 0 min 16.3 sec: PASS arm-tegra_defconfig ------------------- tegra124-jetson-tk1 0 min 18.4 sec: PASS tegra30-beaver 0 min 23.8 sec: PASS arm-multi_v7_defconfig+CONFIG_ARM_LPAE=y ---------------------------------------- tegra124-jetson-tk1 0 min 18.5 sec: PASS armada-xp-openblocks-ax3-4 0 min 24.4 sec: PASS omap5-uevm 1 min 41.7 sec: PASS (Warnings: 1) sun7i-a20-cubieboard2 0 min 13.5 sec: PASS arm-mvebu_v7_defconfig+CONFIG_CPU_BIG_ENDIAN=y ---------------------------------------------- armada-xp-openblocks-ax3-4 0 min 24.1 sec: PASS armada-370-mirabox 0 min 21.0 sec: PASS arm-omap2plus_defconfig ----------------------- legacy,3730xm 0 min 40.6 sec: PASS am335x-boneblack 0 min 23.1 sec: PASS omap3-beagle-xm 0 min 50.2 sec: PASS legacy,3530beagle 0 min 24.1 sec: PASS (Warnings: 1) omap4-panda 0 min 55.1 sec: PASS (Warnings: 1) omap3-overo-tobi 0 min 23.8 sec: PASS am335x-bone 0 min 24.7 sec: PASS omap3-overo-storm-tobi 0 min 25.6 sec: PASS omap5-uevm 0 min 57.2 sec: PASS (Warnings: 1) omap3-n900 0 min 17.8 sec: PASS legacy,n900 0 min 17.6 sec: PASS (Warnings: 1) omap4-panda-es 0 min 55.9 sec: PASS (Warnings: 1) legacy,3730storm 0 min 20.9 sec: PASS legacy,3530overo 0 min 21.8 sec: PASS (Warnings: 1) arm-multi_v7_defconfig ---------------------- imx6dl-wandboard,wand-solo 0 min 15.9 sec: PASS am335x-boneblack 0 min 22.6 sec: PASS sun7i-a20-cubieboard2 0 min 13.4 sec: PASS sun4i-a10-cubieboard 0 min 18.0 sec: PASS exynos5410-smdk5410 0 min 29.1 sec: PASS am335x-bone 0 min 24.1 sec: PASS tegra124-jetson-tk1 0 min 18.6 sec: PASS armada-370-mirabox 0 min 22.3 sec: PASS omap4-panda 0 min 58.0 sec: PASS (Warnings: 1) imx6q-wandboard 0 min 14.6 sec: PASS imx6dl-wandboard,wand-dual 0 min 15.9 sec: PASS ste-snowball 1 min 16.0 sec: PASS tegra30-beaver 0 min 28.1 sec: PASS omap3-n900 0 min 16.3 sec: PASS qcom-apq8074-dragonboard 0 min 20.4 sec: PASS bcm28155-ap 0 min 26.3 sec: PASS omap3-overo-tobi 0 min 25.8 sec: PASS omap3-overo-storm-tobi 0 min 24.8 sec: PASS omap3-beagle-xm 0 min 51.4 sec: PASS exynos5420-arndale-octa 0 min 42.9 sec: PASS armada-xp-openblocks-ax3-4 0 min 25.5 sec: PASS omap5-uevm 1 min 46.9 sec: PASS (Warnings: 1) omap4-panda-es 0 min 54.5 sec: PASS (Warnings: 1) exynos5250-arndale 0 min 33.5 sec: PASS arm-sunxi_defconfig ------------------- sun7i-a20-cubieboard2 0 min 12.1 sec: PASS sun4i-a10-cubieboard 0 min 15.0 sec: PASS arm-qcom_defconfig ------------------ qcom-apq8074-dragonboard 0 min 19.3 sec: PASS arm-bcm_defconfig ----------------- bcm28155-ap 0 min 23.5 sec: PASS arm-exynos_defconfig -------------------- exynos5420-arndale-octa 0 min 37.5 sec: FAIL exynos5250-arndale 0 min 30.2 sec: PASS exynos5410-smdk5410 0 min 30.1 sec: PASS arm-imx_v6_v7_defconfig ----------------------- imx6dl-wandboard,wand-dual 0 min 16.2 sec: PASS imx6dl-wandboard,wand-solo 0 min 16.6 sec: PASS imx6q-wandboard 0 min 14.9 sec: PASS arm-u8500_defconfig ------------------- ste-snowball 1 min 53.5 sec: FAIL arm-multi_v7_defconfig+CONFIG_CPU_BIG_ENDIAN=y ---------------------------------------------- armada-xp-openblocks-ax3-4 0 min 27.1 sec: PASS armada-370-mirabox 0 min 23.7 sec: PASS arm-mvebu_v7_defconfig ---------------------- armada-xp-openblocks-ax3-4 0 min 22.6 sec: PASS armada-370-mirabox 0 min 20.6 sec: PASS arm-sama5_defconfig ------------------- sama5d35ek 0 min 16.1 sec: PASS (Warnings: 1)
10 years, 8 months
1
0
0
0
[PATCH] irqchip: nvic: Use the generic noop function
by Daniel Thompson
Using the generic function saves looking up this custom one in a source navigator. Signed-off-by: Daniel Thompson <daniel.thompson(a)linaro.org> Cc: Thomas Gleixner <tglx(a)linutronix.de> Cc: Jason Cooper <jason(a)lakedaemon.net> --- drivers/irqchip/irq-nvic.c | 10 +--------- 1 file changed, 1 insertion(+), 9 deletions(-) diff --git a/drivers/irqchip/irq-nvic.c b/drivers/irqchip/irq-nvic.c index 70bdf6e..c935c61 100644 --- a/drivers/irqchip/irq-nvic.c +++ b/drivers/irqchip/irq-nvic.c @@ -49,14 +49,6 @@ nvic_handle_irq(irq_hw_number_t hwirq, struct pt_regs *regs) handle_IRQ(irq, regs); } -static void nvic_eoi(struct irq_data *d) -{ - /* - * This is a no-op as end of interrupt is signaled by the exception - * return sequence. - */ -} - static int __init nvic_of_init(struct device_node *node, struct device_node *parent) { @@ -102,7 +94,7 @@ static int __init nvic_of_init(struct device_node *node, gc->chip_types[0].regs.disable = NVIC_ICER; gc->chip_types[0].chip.irq_mask = irq_gc_mask_disable_reg; gc->chip_types[0].chip.irq_unmask = irq_gc_unmask_enable_reg; - gc->chip_types[0].chip.irq_eoi = nvic_eoi; + gc->chip_types[0].chip.irq_eoi = irq_gc_noop; /* disable interrupts */ writel_relaxed(~0, gc->reg_base + NVIC_ICER); -- 1.9.0
10 years, 8 months
4
4
0
0
next boot: 64 boots: 63 pass, 1 fail (next-20140620)
by Kevin's boot bot
Full logs here:
http://armcloud.us/kernel-ci/next/next-20140620
Tree/Branch: next Git describe: next-20140620 Failed boot tests ================= exynos5420-arndale-octa: FAIL: arm-exynos_defconfig
http://armcloud.us/kernel-ci/next/next-20140620/arm-exynos_defconfig/boot-e…
Full Report =========== arm-davinci_all_defconfig ------------------------- legacy,dm365evm 0 min 17.5 sec: PASS da850-evm 0 min 15.5 sec: PASS arm-tegra_defconfig ------------------- tegra124-jetson-tk1 0 min 17.8 sec: PASS tegra30-beaver 0 min 17.5 sec: PASS arm-multi_v7_defconfig+CONFIG_ARM_LPAE=y ---------------------------------------- tegra124-jetson-tk1 0 min 17.8 sec: PASS armada-xp-openblocks-ax3-4 0 min 24.0 sec: PASS omap5-uevm 1 min 38.8 sec: PASS (Warnings: 1) sun7i-a20-cubieboard2 0 min 13.0 sec: PASS arm-mvebu_v7_defconfig+CONFIG_CPU_BIG_ENDIAN=y ---------------------------------------------- armada-xp-openblocks-ax3-4 0 min 24.0 sec: PASS armada-370-mirabox 0 min 20.7 sec: PASS arm-omap2plus_defconfig ----------------------- legacy,3730xm 0 min 43.5 sec: PASS am335x-boneblack 0 min 22.4 sec: PASS omap3-beagle-xm 0 min 48.8 sec: PASS legacy,3530beagle 0 min 27.2 sec: PASS (Warnings: 1) omap4-panda 0 min 56.8 sec: PASS (Warnings: 1) omap3-overo-tobi 0 min 22.7 sec: PASS am335x-bone 0 min 34.0 sec: PASS omap3-overo-storm-tobi 0 min 24.9 sec: PASS omap5-uevm 0 min 53.3 sec: PASS (Warnings: 1) omap3-n900 0 min 16.6 sec: PASS legacy,n900 0 min 17.3 sec: PASS (Warnings: 2) omap4-panda-es 0 min 51.1 sec: PASS (Warnings: 1) legacy,3730storm 0 min 22.6 sec: PASS legacy,3530overo 0 min 20.7 sec: PASS (Warnings: 1) arm-multi_v7_defconfig ---------------------- imx6dl-wandboard,wand-solo 0 min 15.6 sec: PASS am335x-boneblack 0 min 22.1 sec: PASS sun7i-a20-cubieboard2 0 min 13.2 sec: PASS sun4i-a10-cubieboard 0 min 17.4 sec: PASS exynos5410-smdk5410 0 min 28.9 sec: PASS am335x-bone 0 min 23.7 sec: PASS tegra124-jetson-tk1 0 min 17.9 sec: PASS armada-370-mirabox 0 min 21.9 sec: PASS omap4-panda 0 min 53.4 sec: PASS (Warnings: 1) imx6q-wandboard 0 min 13.7 sec: PASS imx6dl-wandboard,wand-dual 0 min 15.3 sec: PASS ste-snowball 1 min 11.9 sec: PASS tegra30-beaver 0 min 17.3 sec: PASS omap3-n900 0 min 16.7 sec: PASS qcom-apq8074-dragonboard 0 min 18.6 sec: PASS bcm28155-ap 0 min 27.2 sec: PASS omap3-overo-tobi 0 min 22.1 sec: PASS omap3-overo-storm-tobi 0 min 24.1 sec: PASS omap3-beagle-xm 0 min 53.5 sec: PASS exynos5420-arndale-octa 0 min 40.2 sec: PASS armada-xp-openblocks-ax3-4 0 min 25.1 sec: PASS omap5-uevm 1 min 37.6 sec: PASS (Warnings: 1) omap4-panda-es 0 min 54.6 sec: PASS (Warnings: 1) exynos5250-arndale 0 min 30.3 sec: PASS arm-sunxi_defconfig ------------------- sun7i-a20-cubieboard2 0 min 11.5 sec: PASS sun4i-a10-cubieboard 0 min 14.5 sec: PASS arm-qcom_defconfig ------------------ qcom-apq8074-dragonboard 0 min 18.1 sec: PASS arm-bcm_defconfig ----------------- bcm28155-ap 0 min 23.1 sec: PASS arm-exynos_defconfig -------------------- exynos5420-arndale-octa 0 min 37.7 sec: FAIL exynos5250-arndale 0 min 29.8 sec: PASS exynos5410-smdk5410 0 min 27.2 sec: PASS arm-imx_v6_v7_defconfig ----------------------- imx6dl-wandboard,wand-dual 0 min 15.3 sec: PASS imx6dl-wandboard,wand-solo 0 min 15.6 sec: PASS imx6q-wandboard 0 min 14.0 sec: PASS arm-u8500_defconfig ------------------- ste-snowball 0 min 25.0 sec: PASS arm-multi_v7_defconfig+CONFIG_CPU_BIG_ENDIAN=y ---------------------------------------------- armada-xp-openblocks-ax3-4 0 min 26.4 sec: PASS armada-370-mirabox 0 min 22.4 sec: PASS arm-mvebu_v7_defconfig ---------------------- armada-xp-openblocks-ax3-4 0 min 22.4 sec: PASS armada-370-mirabox 0 min 20.1 sec: PASS arm-sama5_defconfig ------------------- sama5d35ek 0 min 15.5 sec: PASS (Warnings: 1)
10 years, 8 months
1
0
0
0
next boot: 64 boots: 61 pass, 1 fail (next-20140620)
by Kevin's boot bot
Tree/Branch: next Git describe: next-20140620 Failed boot tests (console logs at the end) =========================================== exynos5420-arndale-octa: FAIL: arm-exynos_defconfig exynos5250-arndale: OFFLINE: arm-exynos_defconfig Offline boards (unable to connect to serial console) ==================================================== exynos5250-arndale: OFFLINE: arm-multi_v7_defconfig exynos5420-arndale-octa: FAIL: arm-exynos_defconfig exynos5250-arndale: OFFLINE: arm-exynos_defconfig Full Report =========== arm-davinci_all_defconfig ------------------------- legacy,dm365evm 0 min 17.5 sec: PASS da850-evm 0 min 15.5 sec: PASS arm-tegra_defconfig ------------------- tegra124-jetson-tk1 0 min 17.8 sec: PASS tegra30-beaver 0 min 17.5 sec: PASS arm-multi_v7_defconfig+CONFIG_ARM_LPAE=y ---------------------------------------- tegra124-jetson-tk1 0 min 17.8 sec: PASS armada-xp-openblocks-ax3-4 0 min 24.0 sec: PASS omap5-uevm 1 min 38.8 sec: PASS (Warnings: 1) sun7i-a20-cubieboard2 0 min 13.0 sec: PASS arm-mvebu_v7_defconfig+CONFIG_CPU_BIG_ENDIAN=y ---------------------------------------------- armada-xp-openblocks-ax3-4 0 min 24.0 sec: PASS armada-370-mirabox 0 min 20.7 sec: PASS arm-omap2plus_defconfig ----------------------- legacy,3730xm 0 min 43.5 sec: PASS am335x-boneblack 0 min 22.4 sec: PASS omap3-beagle-xm 0 min 48.8 sec: PASS legacy,3530beagle 0 min 27.2 sec: PASS (Warnings: 1) omap4-panda 0 min 56.8 sec: PASS (Warnings: 1) omap3-overo-tobi 0 min 22.7 sec: PASS am335x-bone 0 min 34.0 sec: PASS omap3-overo-storm-tobi 0 min 24.9 sec: PASS omap5-uevm 0 min 53.3 sec: PASS (Warnings: 1) omap3-n900 0 min 16.6 sec: PASS legacy,n900 0 min 17.3 sec: PASS (Warnings: 2) omap4-panda-es 0 min 51.1 sec: PASS (Warnings: 1) legacy,3730storm 0 min 22.6 sec: PASS legacy,3530overo 0 min 20.7 sec: PASS (Warnings: 1) arm-multi_v7_defconfig ---------------------- imx6dl-wandboard,wand-solo 0 min 15.6 sec: PASS am335x-boneblack 0 min 22.1 sec: PASS sun7i-a20-cubieboard2 0 min 13.2 sec: PASS sun4i-a10-cubieboard 0 min 17.4 sec: PASS exynos5410-smdk5410 0 min 28.9 sec: PASS am335x-bone 0 min 23.7 sec: PASS tegra124-jetson-tk1 0 min 17.9 sec: PASS armada-370-mirabox 0 min 21.9 sec: PASS omap4-panda 0 min 53.4 sec: PASS (Warnings: 1) imx6q-wandboard 0 min 13.7 sec: PASS imx6dl-wandboard,wand-dual 0 min 15.3 sec: PASS ste-snowball 1 min 11.9 sec: PASS tegra30-beaver 0 min 17.3 sec: PASS omap3-n900 0 min 16.7 sec: PASS qcom-apq8074-dragonboard 0 min 18.6 sec: PASS bcm28155-ap 0 min 27.2 sec: PASS omap3-overo-tobi 0 min 22.1 sec: PASS omap3-overo-storm-tobi 0 min 24.1 sec: PASS omap3-beagle-xm 0 min 53.5 sec: PASS exynos5420-arndale-octa 0 min 40.2 sec: PASS armada-xp-openblocks-ax3-4 0 min 25.1 sec: PASS omap5-uevm 1 min 37.6 sec: PASS (Warnings: 1) omap4-panda-es 0 min 54.6 sec: PASS (Warnings: 1) exynos5250-arndale 0 min 31.4 sec: OFFLINE arm-sunxi_defconfig ------------------- sun7i-a20-cubieboard2 0 min 11.5 sec: PASS sun4i-a10-cubieboard 0 min 14.5 sec: PASS arm-qcom_defconfig ------------------ qcom-apq8074-dragonboard 0 min 18.1 sec: PASS arm-bcm_defconfig ----------------- bcm28155-ap 0 min 23.1 sec: PASS arm-exynos_defconfig -------------------- exynos5420-arndale-octa 0 min 37.4 sec: FAIL exynos5250-arndale 0 min 31.4 sec: OFFLINE exynos5410-smdk5410 0 min 27.2 sec: PASS arm-imx_v6_v7_defconfig ----------------------- imx6dl-wandboard,wand-dual 0 min 15.3 sec: PASS imx6dl-wandboard,wand-solo 0 min 15.6 sec: PASS imx6q-wandboard 0 min 14.0 sec: PASS arm-u8500_defconfig ------------------- ste-snowball 0 min 25.0 sec: PASS arm-multi_v7_defconfig+CONFIG_CPU_BIG_ENDIAN=y ---------------------------------------------- armada-xp-openblocks-ax3-4 0 min 26.4 sec: PASS armada-370-mirabox 0 min 22.4 sec: PASS arm-mvebu_v7_defconfig ---------------------- armada-xp-openblocks-ax3-4 0 min 22.4 sec: PASS armada-370-mirabox 0 min 20.1 sec: PASS arm-sama5_defconfig ------------------- sama5d35ek 0 min 15.5 sec: PASS (Warnings: 1) Console logs for failures ========================= arm-exynos_defconfig -------------------- exynos5420-arndale-octa: FAIL: last 40 lines of boot log: --------------------------------------------------------- [ 16.248134] of_get_named_gpiod_flags exited with status 0 [ 16.252243] mmcblk0: p1 p2 p3 p4 [ 16.255413] Unhandled fault: external abort on non-linefetch (0x008) at 0xf00bc088 [ 16.262949] Internal error: : 8 [#2] PREEMPT SMP ARM [ 16.267885] Modules linked in: [ 16.270924] CPU: 0 PID: 6 Comm: kworker/u16:0 Tainted: G D 3.16.0-rc1-next-20140620 #1 [ 16.279766] Workqueue: kmmcd mmc_rescan [ 16.283571] task: ef014000 ti: ef0b4000 task.ti: ef0b4000 [ 16.288950] PC is at rescan_partitions+0xb4/0x290 [ 16.293623] LR is at 0xf00bc000 [ 16.296745] pc : [<c01b0948>] lr : [<f00bc000>] psr: 20000113 [ 16.296745] sp : ef0b5c80 ip : 00000000 fp : 00000000 [ 16.308181] r10: 00000000 r9 : ef202400 r8 : ed640200 [ 16.313380] r7 : 00000000 r6 : eec24280 r5 : 00000000 r4 : 00000008 [ 16.319879] r3 : 00000013 r2 : 00000000 r1 : 00000000 r0 : 00000001 [ 16.326380] Flags: nzCv IRQs on FIQs on Mode SVC_32 ISA ARM Segment kernel [ 16.333658] Control: 10c5387d Table: 2000406a DAC: 00000015 [ 16.339376] Process kworker/u16:0 (pid: 6, stack limit = 0xef0b4240) [ 16.345702] Stack: (0xef0b5c80 to 0xef0b6000) [ 16.350038] 5c80: c054b37c 00000001 ef0b4000 c038b5c0 00000001 c05265b8 ed5e7598 c0526488 [ 16.358183] 5ca0: eec24380 ed5e7468 eec24330 eec24280 00000000 ed5e7468 00000000 00000000 [ 16.366328] 5cc0: 00000000 eec24280 ed640200 eec24290 00000001 00000000 00000000 c00e3f50 [ 16.374473] 5ce0: c00e2950 00000000 00000000 00000001 eec24280 00000000 ed640270 ed64020c [ 16.382619] 5d00: 00000000 ed5e7380 00000003 c00e41b4 c05287d4 00000001 00000003 c038ca60 [ 16.390764] 5d20: c05287d4 c00e2ec8 ef0b5d34 c022359c ed640240 00000001 eec24280 ed640200 [ 16.398910] 5d40: ed640270 ed64020c 00000000 ed5e7380 00000003 c01ae860 c01ad6ac ed640200 [ 16.407056] 5d60: 00000080 0b300000 00000002 ef347c00 ef347800 ef343400 ef343400 ef3436bc [ 16.415201] 5d80: c02bd028 ef347800 ef343400 ef347988 ef0b5dd6 c02bdf2c 00000056 ef34786c [ 16.423346] 5da0: 00000003 ef347c00 ef347800 c02beb5c 00000003 ef0b5dd6 00000008 ed59d000 [ 16.431491] 5dc0: c046a3a8 ef343698 00000000 34362e33 42694720 32310000 694b2038 c0000042 [ 16.439637] 5de0: 00000001 ef347808 c058d0a8 00000000 c054b304 00000001 00000000 c054afb0 [ 16.447783] 5e00: ef013c00 c02b3470 c02b3458 c0227040 00000000 ef347808 c02271f0 ef346c08 [ 16.455928] 5e20: 00000000 c022581c ef395698 ed4f1c44 ef347808 ef34783c c054aed0 c0226f1c [ 16.464073] 5e40: ef347808 ef347808 c054aed0 c022668c ef347808 00000000 ef347810 c0224cf4 [ 16.472220] 5e60: ef013c00 c0385538 c047d00c ef0b5e84 00061a80 ef347800 ef347808 c047cfb8 [ 16.480364] 5e80: 00061a80 c03b585c 00000000 c02b3890 c047cfb8 c0454ac0 c047cf74 00000001 [ 16.488510] 5ea0: ef346c00 00000000 ef346c00 c02b62f8 00061a80 40ff8080 00000000 ef3~$off # PYBOOT: Exception: kernel: ERROR: failed to boot: Unhandled fault # PYBOOT: Time: 37.43 seconds. # PYBOOT: Result: FAIL exynos5250-arndale: OFFLINE: last 40 lines of boot log: ------------------------------------------------------- Connected to arndale console [channel connected] (~$quit to exit) (user:khilman) is already connected (user:khilman) is already connected (user:khilman) is already connected ~$hardreset Command(arndale console)> hardreset (user:khilman) Reboot arndale ~$off # PYBOOT: Exception: ('ERROR: Could not break into u-boot.', 'OFFLINE') # PYBOOT: Time: 31.42 seconds. # PYBOOT: Result: OFFLINE
10 years, 8 months
1
0
0
0
mainline boot: 64 boots: 60 pass, 2 fail (v3.16-rc1-215-g3c8fb50)
by Kevin's boot bot
Tree/Branch: mainline Git describe: v3.16-rc1-215-g3c8fb50 Failed boot tests (console logs at the end) =========================================== exynos5420-arndale-octa: FAIL: arm-exynos_defconfig exynos5250-arndale: OFFLINE: arm-exynos_defconfig ste-snowball: FAIL: arm-u8500_defconfig Offline boards (unable to connect to serial console) ==================================================== exynos5250-arndale: OFFLINE: arm-multi_v7_defconfig exynos5420-arndale-octa: FAIL: arm-exynos_defconfig exynos5250-arndale: OFFLINE: arm-exynos_defconfig Full Report =========== arm-davinci_all_defconfig ------------------------- legacy,dm365evm 0 min 17.5 sec: PASS da850-evm 0 min 15.4 sec: PASS arm-tegra_defconfig ------------------- tegra124-jetson-tk1 0 min 17.7 sec: PASS tegra30-beaver 0 min 17.4 sec: PASS arm-multi_v7_defconfig+CONFIG_ARM_LPAE=y ---------------------------------------- tegra124-jetson-tk1 0 min 20.1 sec: PASS armada-xp-openblocks-ax3-4 0 min 24.0 sec: PASS omap5-uevm 1 min 42.5 sec: PASS (Warnings: 1) sun7i-a20-cubieboard2 0 min 13.0 sec: PASS arm-mvebu_v7_defconfig+CONFIG_CPU_BIG_ENDIAN=y ---------------------------------------------- armada-xp-openblocks-ax3-4 0 min 23.8 sec: PASS armada-370-mirabox 0 min 21.1 sec: PASS arm-omap2plus_defconfig ----------------------- legacy,3730xm 0 min 41.4 sec: PASS am335x-boneblack 0 min 22.3 sec: PASS omap3-beagle-xm 0 min 55.4 sec: PASS legacy,3530beagle 0 min 23.4 sec: PASS (Warnings: 1) omap4-panda 0 min 54.3 sec: PASS (Warnings: 1) omap3-overo-tobi 0 min 22.6 sec: PASS am335x-bone 0 min 23.8 sec: PASS omap3-overo-storm-tobi 0 min 21.0 sec: PASS omap5-uevm 0 min 59.5 sec: PASS (Warnings: 1) omap3-n900 0 min 17.4 sec: PASS legacy,n900 0 min 16.1 sec: PASS (Warnings: 1) omap4-panda-es 0 min 51.6 sec: PASS (Warnings: 1) legacy,3730storm 0 min 23.1 sec: PASS legacy,3530overo 0 min 21.0 sec: PASS (Warnings: 1) arm-multi_v7_defconfig ---------------------- imx6dl-wandboard,wand-solo 0 min 15.5 sec: PASS am335x-boneblack 0 min 22.0 sec: PASS sun7i-a20-cubieboard2 0 min 12.9 sec: PASS sun4i-a10-cubieboard 0 min 17.3 sec: PASS exynos5410-smdk5410 0 min 28.9 sec: PASS am335x-bone 0 min 28.7 sec: PASS tegra124-jetson-tk1 0 min 17.9 sec: PASS armada-370-mirabox 0 min 21.7 sec: PASS omap4-panda 0 min 55.8 sec: PASS (Warnings: 1) imx6q-wandboard 0 min 13.9 sec: PASS imx6dl-wandboard,wand-dual 0 min 15.2 sec: PASS ste-snowball 1 min 11.5 sec: PASS tegra30-beaver 0 min 19.9 sec: PASS omap3-n900 0 min 16.0 sec: PASS qcom-apq8074-dragonboard 0 min 19.6 sec: PASS bcm28155-ap 0 min 26.8 sec: PASS omap3-overo-tobi 0 min 22.4 sec: PASS omap3-overo-storm-tobi 0 min 24.1 sec: PASS omap3-beagle-xm 0 min 48.4 sec: PASS exynos5420-arndale-octa 0 min 39.9 sec: PASS armada-xp-openblocks-ax3-4 0 min 25.1 sec: PASS omap5-uevm 1 min 39.2 sec: PASS (Warnings: 1) omap4-panda-es 0 min 55.7 sec: PASS (Warnings: 1) exynos5250-arndale 0 min 31.4 sec: OFFLINE arm-sunxi_defconfig ------------------- sun7i-a20-cubieboard2 0 min 11.3 sec: PASS sun4i-a10-cubieboard 0 min 11.5 sec: PASS arm-qcom_defconfig ------------------ qcom-apq8074-dragonboard 0 min 18.2 sec: PASS arm-bcm_defconfig ----------------- bcm28155-ap 0 min 22.9 sec: PASS arm-exynos_defconfig -------------------- exynos5420-arndale-octa 0 min 37.5 sec: FAIL exynos5250-arndale 0 min 31.4 sec: OFFLINE exynos5410-smdk5410 0 min 27.2 sec: PASS arm-imx_v6_v7_defconfig ----------------------- imx6dl-wandboard,wand-dual 0 min 15.7 sec: PASS imx6dl-wandboard,wand-solo 0 min 16.0 sec: PASS imx6q-wandboard 0 min 14.1 sec: PASS arm-u8500_defconfig ------------------- ste-snowball 1 min 50.6 sec: FAIL arm-multi_v7_defconfig+CONFIG_CPU_BIG_ENDIAN=y ---------------------------------------------- armada-xp-openblocks-ax3-4 0 min 26.7 sec: PASS armada-370-mirabox 0 min 23.4 sec: PASS arm-mvebu_v7_defconfig ---------------------- armada-xp-openblocks-ax3-4 0 min 22.6 sec: PASS armada-370-mirabox 0 min 20.1 sec: PASS arm-sama5_defconfig ------------------- sama5d35ek 0 min 15.4 sec: PASS (Warnings: 1) Console logs for failures ========================= arm-exynos_defconfig -------------------- exynos5420-arndale-octa: FAIL: last 40 lines of boot log: --------------------------------------------------------- [ 16.240800] mmcblk0: p1 p2 p3 p4 [ 16.243970] Unhandled fault: external abort on non-linefetch (0x008) at 0xf00bc088 [ 16.251507] Internal error: : 8 [#2] PREEMPT SMP ARM [ 16.256442] Modules linked in: [ 16.259480] CPU: 0 PID: 6 Comm: kworker/u16:0 Tainted: G D 3.16.0-rc1-00215-g3c8fb50 #1 [ 16.268409] Workqueue: kmmcd mmc_rescan [ 16.272216] task: ef014000 ti: ef0b4000 task.ti: ef0b4000 [ 16.277593] PC is at rescan_partitions+0xb4/0x290 [ 16.282267] LR is at 0xf00bc000 [ 16.285388] pc : [<c01afdec>] lr : [<f00bc000>] psr: 20000113 [ 16.285388] sp : ef0b5c80 ip : 00000000 fp : 00000000 [ 16.296824] r10: 00000000 r9 : ed6ff140 r8 : ef203200 [ 16.302024] r7 : 00000000 r6 : eec24280 r5 : 00000000 r4 : 00000008 [ 16.308523] r3 : 00000013 r2 : 00000000 r1 : 00000000 r0 : 00000001 [ 16.315023] Flags: nzCv IRQs on FIQs on Mode SVC_32 ISA ARM Segment kernel [ 16.322302] Control: 10c5387d Table: 2000406a DAC: 00000015 [ 16.328020] Process kworker/u16:0 (pid: 6, stack limit = 0xef0b4240) [ 16.334346] Stack: (0xef0b5c80 to 0xef0b6000) [ 16.338682] 5c80: c0548484 00000001 ef0b4000 c0389020 00000001 c05245b8 ef2c7598 c0524488 [ 16.346827] 5ca0: eec24380 ef2c7468 eec24330 eec24280 00000000 ef2c7468 00000000 00000000 [ 16.354972] 5cc0: 00000000 eec24280 ef203200 eec24290 00000001 00000000 00000000 c00e3ae0 [ 16.363117] 5ce0: c00e24e0 00000000 00000000 00000001 eec24280 00000000 ef203270 ef20320c [ 16.371263] 5d00: 00000000 ef2c7380 00000003 c00e3d44 c0526794 00000001 00000003 c038a4a0 [ 16.379408] 5d20: c0526794 c00e2a58 ef0b5d34 c02224ec ef203240 00000001 eec24280 ef203200 [ 16.387554] 5d40: ef203270 ef20320c 00000000 ef2c7380 00000003 c01add04 c01acb58 ef203200 [ 16.395700] 5d60: 00000080 0b300000 00000002 ed5a6800 ed5a6000 ed5a4400 ed5a4400 ed5a46bc [ 16.403845] 5d80: c02bb95c ed5a6000 ed5a4400 ed5a6188 ef0b5dd6 c02bc860 00000056 ed5a606c [ 16.411990] 5da0: 00000003 ed5a6800 ed5a6000 c02bd490 00000003 ef0b5dd6 00000008 ef335708 [ 16.420135] 5dc0: c046732c ed5a4698 00000000 34362e33 42694720 32310000 694b2038 c0000042 [ 16.428282] 5de0: 00000001 ed5a6008 c058a11c 00000000 c054840c 00000001 00000000 c05480b8 [ 16.436427] 5e00: ef013c00 c02b1de0 c02b1dc8 c0225f90 00000000 ed5a6008 c0226140 ed5a1008 [ 16.444572] 5e20: 00000000 c022476c ef2d9698 ed4d45c4 ed5a6008 ed5a603c c0547fd8 c0225e6c [ 16.452718] 5e40: ed5a6008 ed5a6008 c0547fd8 c02255dc ed5a6008 00000000 ed5a6010 c0223c44 [ 16.460863] 5e60: ef013c00 c0382f98 c0479d54 ef0b5e84 00061a80 ed5a6000 ed5a6008 c0479d00 [ 16.469009] 5e80: 00061a80 c03b3794 00000000 c02b2200 c0479d00 c0451b30 c0479cbc 00000001 [ 16.477154] 5ea0: ed5a1000 00000000 ed5a1000 c02b4c4c 00061a80 40ff8080 00000000 ed5a11ec [ 16.4~$off # PYBOOT: Exception: kernel: ERROR: failed to boot: Unhandled fault # PYBOOT: Time: 37.54 seconds. # PYBOOT: Result: FAIL exynos5250-arndale: OFFLINE: last 40 lines of boot log: ------------------------------------------------------- Connected to arndale console [channel connected] (~$quit to exit) (user:khilman) is already connected (user:khilman) is already connected (user:khilman) is already connected ~$hardreset Command(arndale console)> hardreset (user:khilman) Reboot arndale ~$off # PYBOOT: Exception: ('ERROR: Could not break into u-boot.', 'OFFLINE') # PYBOOT: Time: 31.40 seconds. # PYBOOT: Result: OFFLINE arm-u8500_defconfig ------------------- ste-snowball: FAIL: last 40 lines of boot log: ---------------------------------------------- [ 3.503479] musb-hdrc musb-hdrc.20.auto: musb_init_controller failed with status -517 [ 3.511322] platform musb-hdrc.20.auto: Driver musb-hdrc requests probe deferral [ 3.519256] pinctrl-nomadik soc:pinctrl: pin GPIO256_AF28 already requested by a03e0000.usb_per5; cannot claim for musb-hdrc.20.auto [ 3.531188] pinctrl-nomadik soc:pinctrl: pin-256 (musb-hdrc.20.auto) status -22 [ 3.538482] pinctrl-nomadik soc:pinctrl: could not request pin 256 (GPIO256_AF28) from group usb_a_1 on device pinctrl-nomadik [ 3.549987] musb-ux500 musb-hdrc.20.auto: Error applying setting, reverse things back [ 3.558502] pinctrl-nomadik soc:pinctrl: pin GPIO256_AF28 already requested by a03e0000.usb_per5; cannot claim for musb-hdrc.21.auto [ 3.570434] pinctrl-nomadik soc:pinctrl: pin-256 (musb-hdrc.21.auto) status -22 [ 3.577758] pinctrl-nomadik soc:pinctrl: could not request pin 256 (GPIO256_AF28) from group usb_a_1 on device pinctrl-nomadik [ 3.589233] musb-hdrc musb-hdrc.21.auto: Error applying setting, reverse things back [ 3.597076] HS USB OTG: no transceiver configured [ 3.601776] musb-hdrc musb-hdrc.21.auto: musb_init_controller failed with status -517 [ 3.609619] platform musb-hdrc.21.auto: Driver musb-hdrc requests probe deferral [ 3.617553] pinctrl-nomadik soc:pinctrl: pin GPIO256_AF28 already requested by a03e0000.usb_per5; cannot claim for musb-hdrc.21.auto [ 3.629486] pinctrl-nomadik soc:pinctrl: pin-256 (musb-hdrc.21.auto) status -22 [ 3.636810] pinctrl-nomadik soc:pinctrl: could not request pin 256 (GPIO256_AF28) from group usb_a_1 on device pinctrl-nomadik [ 3.648284] musb-ux500 musb-hdrc.21.auto: Error applying setting, reverse things back [ 3.656799] pinctrl-nomadik soc:pinctrl: pin GPIO256_AF28 already requested by a03e0000.usb_per5; cannot claim for musb-hdrc.22.auto [ 3.668731] pinctrl-nomadik soc:pinctrl: pin-256 (musb-hdrc.22.auto) status -22 [ 3.676055] pinctrl-nomadik soc:pinctrl: could not request pin 256 (GPIO256_AF28) from group usb_a_1 on device pinctrl-nomadik [ 3.687530] musb-hdrc musb-hdrc.22.auto: Error applying setting, reverse things back [ 3.695343] HS USB OTG: no transceiver configured [ 3.700042] musb-hdrc musb-hdrc.22.auto: musb_init_controller failed with status -517 [ 3.707916] platform musb-hdrc.22.auto: Driver musb-hdrc requests probe deferral [ 3.715850] pinctrl-nomadik soc:pinctrl: pin GPIO256_AF28 already requested by a03e0000.usb_per5; cannot claim for musb-hdrc.22.auto [ 3.727752] pinctrl-nomadik soc:pinctrl: pin-256 (musb-hdrc.22.auto) status -22 [ 3.735076] pinctrl-nomadik soc:pinctrl: could not request pin 256 (GPIO256_AF28) from group usb_a_1 on device pinctrl-nomadik [ 3.746551] musb-ux500 musb-hdrc.22.auto: Error applying setting, reverse things back [ 3.755096] pinctrl-nomadik soc:pinctrl: pin GPIO256_AF28 already requested by a03e0000.usb_per5; cannot claim for musb-hdrc.23.auto [ 3.767028] pinctrl-nomadik soc:pinctrl: pin-256 (musb-hdrc.23.auto) status -22 [ 3.774353] pinctrl-nomadik soc:pinctrl: could not request pin 256 (GPIO256_AF28) from group usb_a_1 on device pinctrl-nomadik [ 3.785827] musb-hdrc musb-hdrc.23.auto: Error applying setting, reverse things back [ 3.793640] HS USB OTG: no transceiver configured [ 3.798339] musb-hdrc musb-hdrc.23.auto: musb_init_controller failed with status -517 [ 3.806213] platform musb-hdrc.23.auto: Driver musb-hdrc requests probe deferral [ 3.814117] pinctrl-nomadik soc:pinctrl: pin GPIO256_AF28 already requested by a03e0000.usb_per5; cannot claim for musb-hdrc.23.auto ~$off # PYBOOT: Exception: kernel: ERROR: failed to boot: <class 'pexpect.TIMEOUT'> # PYBOOT: Time: 110.59 seconds. # PYBOOT: Result: FAIL
10 years, 8 months
1
0
0
0
mainline boot: 64 boots: 63 pass, 1 fail (v3.16-rc1-112-g894e552)
by Kevin's boot bot
Tree/Branch: mainline Git describe: v3.16-rc1-112-g894e552 Failed boot tests (console logs at the end) =========================================== ste-snowball: FAIL: arm-u8500_defconfig Full Report =========== arm-davinci_all_defconfig ------------------------- legacy,dm365evm 0 min 17.8 sec: PASS da850-evm 0 min 15.7 sec: PASS arm-tegra_defconfig ------------------- tegra124-jetson-tk1 0 min 18.0 sec: PASS tegra30-beaver 0 min 24.0 sec: PASS arm-multi_v7_defconfig+CONFIG_ARM_LPAE=y ---------------------------------------- tegra124-jetson-tk1 0 min 18.0 sec: PASS armada-xp-openblocks-ax3-4 0 min 24.9 sec: PASS omap5-uevm 1 min 42.1 sec: PASS (Warnings: 1) sun7i-a20-cubieboard2 0 min 13.2 sec: PASS arm-mvebu_v7_defconfig+CONFIG_CPU_BIG_ENDIAN=y ---------------------------------------------- armada-xp-openblocks-ax3-4 0 min 24.3 sec: PASS armada-370-mirabox 0 min 26.0 sec: PASS arm-omap2plus_defconfig ----------------------- legacy,3730xm 0 min 40.6 sec: PASS am335x-boneblack 0 min 22.7 sec: PASS omap3-beagle-xm 0 min 48.6 sec: PASS legacy,3530beagle 0 min 27.6 sec: PASS (Warnings: 1) omap4-panda 0 min 57.1 sec: PASS (Warnings: 1) omap3-overo-tobi 0 min 23.4 sec: PASS am335x-bone 0 min 24.5 sec: PASS omap3-overo-storm-tobi 0 min 25.4 sec: PASS omap5-uevm 0 min 56.3 sec: PASS (Warnings: 1) omap3-n900 0 min 18.1 sec: PASS legacy,n900 0 min 17.1 sec: PASS (Warnings: 1) omap4-panda-es 0 min 52.7 sec: PASS (Warnings: 1) legacy,3730storm 0 min 23.0 sec: PASS legacy,3530overo 0 min 21.4 sec: PASS (Warnings: 1) arm-multi_v7_defconfig ---------------------- imx6dl-wandboard,wand-solo 0 min 15.5 sec: PASS am335x-boneblack 0 min 22.5 sec: PASS sun7i-a20-cubieboard2 0 min 13.2 sec: PASS sun4i-a10-cubieboard 0 min 17.5 sec: PASS exynos5410-smdk5410 0 min 29.1 sec: PASS am335x-bone 0 min 24.2 sec: PASS tegra124-jetson-tk1 0 min 17.8 sec: PASS armada-370-mirabox 0 min 22.2 sec: PASS omap4-panda 0 min 51.0 sec: PASS (Warnings: 1) imx6q-wandboard 0 min 14.0 sec: PASS imx6dl-wandboard,wand-dual 0 min 18.6 sec: PASS ste-snowball 1 min 12.0 sec: PASS tegra30-beaver 0 min 22.1 sec: PASS omap3-n900 0 min 20.1 sec: PASS qcom-apq8074-dragonboard 0 min 25.6 sec: PASS bcm28155-ap 0 min 27.4 sec: PASS omap3-overo-tobi 0 min 26.4 sec: PASS omap3-overo-storm-tobi 0 min 25.7 sec: PASS omap3-beagle-xm 0 min 56.5 sec: PASS exynos5420-arndale-octa 0 min 40.4 sec: PASS armada-xp-openblocks-ax3-4 0 min 29.2 sec: PASS omap5-uevm 1 min 39.6 sec: PASS (Warnings: 1) omap4-panda-es 0 min 57.3 sec: PASS (Warnings: 1) exynos5250-arndale 0 min 36.8 sec: PASS arm-sunxi_defconfig ------------------- sun7i-a20-cubieboard2 0 min 12.0 sec: PASS sun4i-a10-cubieboard 0 min 14.8 sec: PASS arm-qcom_defconfig ------------------ qcom-apq8074-dragonboard 0 min 17.2 sec: PASS arm-bcm_defconfig ----------------- bcm28155-ap 0 min 22.7 sec: PASS arm-exynos_defconfig -------------------- exynos5420-arndale-octa 0 min 38.9 sec: PASS exynos5250-arndale 0 min 30.1 sec: PASS exynos5410-smdk5410 0 min 27.6 sec: PASS arm-imx_v6_v7_defconfig ----------------------- imx6dl-wandboard,wand-dual 0 min 16.1 sec: PASS imx6dl-wandboard,wand-solo 0 min 16.1 sec: PASS imx6q-wandboard 0 min 14.3 sec: PASS arm-u8500_defconfig ------------------- ste-snowball 1 min 50.6 sec: FAIL arm-multi_v7_defconfig+CONFIG_CPU_BIG_ENDIAN=y ---------------------------------------------- armada-xp-openblocks-ax3-4 0 min 27.4 sec: PASS armada-370-mirabox 0 min 23.1 sec: PASS arm-mvebu_v7_defconfig ---------------------- armada-xp-openblocks-ax3-4 0 min 22.3 sec: PASS armada-370-mirabox 0 min 20.2 sec: PASS arm-sama5_defconfig ------------------- sama5d35ek 0 min 15.8 sec: PASS (Warnings: 1) Console logs for failures ========================= arm-u8500_defconfig ------------------- ste-snowball: FAIL: last 40 lines of boot log: ---------------------------------------------- [ 3.493377] musb-hdrc musb-hdrc.20.auto: musb_init_controller failed with status -517 [ 3.501251] platform musb-hdrc.20.auto: Driver musb-hdrc requests probe deferral [ 3.509155] pinctrl-nomadik soc:pinctrl: pin GPIO256_AF28 already requested by a03e0000.usb_per5; cannot claim for musb-hdrc.20.auto [ 3.521087] pinctrl-nomadik soc:pinctrl: pin-256 (musb-hdrc.20.auto) status -22 [ 3.528381] pinctrl-nomadik soc:pinctrl: could not request pin 256 (GPIO256_AF28) from group usb_a_1 on device pinctrl-nomadik [ 3.539886] musb-ux500 musb-hdrc.20.auto: Error applying setting, reverse things back [ 3.548431] pinctrl-nomadik soc:pinctrl: pin GPIO256_AF28 already requested by a03e0000.usb_per5; cannot claim for musb-hdrc.21.auto [ 3.560363] pinctrl-nomadik soc:pinctrl: pin-256 (musb-hdrc.21.auto) status -22 [ 3.567687] pinctrl-nomadik soc:pinctrl: could not request pin 256 (GPIO256_AF28) from group usb_a_1 on device pinctrl-nomadik [ 3.579162] musb-hdrc musb-hdrc.21.auto: Error applying setting, reverse things back [ 3.586975] HS USB OTG: no transceiver configured [ 3.591705] musb-hdrc musb-hdrc.21.auto: musb_init_controller failed with status -517 [ 3.599548] platform musb-hdrc.21.auto: Driver musb-hdrc requests probe deferral [ 3.607452] pinctrl-nomadik soc:pinctrl: pin GPIO256_AF28 already requested by a03e0000.usb_per5; cannot claim for musb-hdrc.21.auto [ 3.619384] pinctrl-nomadik soc:pinctrl: pin-256 (musb-hdrc.21.auto) status -22 [ 3.626708] pinctrl-nomadik soc:pinctrl: could not request pin 256 (GPIO256_AF28) from group usb_a_1 on device pinctrl-nomadik [ 3.638183] musb-ux500 musb-hdrc.21.auto: Error applying setting, reverse things back [ 3.646728] pinctrl-nomadik soc:pinctrl: pin GPIO256_AF28 already requested by a03e0000.usb_per5; cannot claim for musb-hdrc.22.auto [ 3.658630] pinctrl-nomadik soc:pinctrl: pin-256 (musb-hdrc.22.auto) status -22 [ 3.665954] pinctrl-nomadik soc:pinctrl: could not request pin 256 (GPIO256_AF28) from group usb_a_1 on device pinctrl-nomadik [ 3.677429] musb-hdrc musb-hdrc.22.auto: Error applying setting, reverse things back [ 3.685272] HS USB OTG: no transceiver configured [ 3.689971] musb-hdrc musb-hdrc.22.auto: musb_init_controller failed with status -517 [ 3.697814] platform musb-hdrc.22.auto: Driver musb-hdrc requests probe deferral [ 3.705749] pinctrl-nomadik soc:pinctrl: pin GPIO256_AF28 already requested by a03e0000.usb_per5; cannot claim for musb-hdrc.22.auto [ 3.717681] pinctrl-nomadik soc:pinctrl: pin-256 (musb-hdrc.22.auto) status -22 [ 3.725006] pinctrl-nomadik soc:pinctrl: could not request pin 256 (GPIO256_AF28) from group usb_a_1 on device pinctrl-nomadik [ 3.736480] musb-ux500 musb-hdrc.22.auto: Error applying setting, reverse things back [ 3.744995] pinctrl-nomadik soc:pinctrl: pin GPIO256_AF28 already requested by a03e0000.usb_per5; cannot claim for musb-hdrc.23.auto [ 3.756927] pinctrl-nomadik soc:pinctrl: pin-256 (musb-hdrc.23.auto) status -22 [ 3.764251] pinctrl-nomadik soc:pinctrl: could not request pin 256 (GPIO256_AF28) from group usb_a_1 on device pinctrl-nomadik [ 3.775726] musb-hdrc musb-hdrc.23.auto: Error applying setting, reverse things back [ 3.783538] HS USB OTG: no transceiver configured [ 3.788238] musb-hdrc musb-hdrc.23.auto: musb_init_controller failed with status -517 [ 3.796112] platform musb-hdrc.23.auto: Driver musb-hdrc requests probe deferral [ 3.804016] pinctrl-nomadik soc:pinctrl: pin GPIO256_AF28 already requested by a03e0000.usb_per5; cannot claim for musb-hdrc.23.auto ~$off # PYBOOT: Exception: kernel: ERROR: failed to boot: <class 'pexpect.TIMEOUT'> # PYBOOT: Time: 110.62 seconds. # PYBOOT: Result: FAIL
10 years, 8 months
1
0
0
0
mainline boot: 64 boots: 63 pass, 1 fail (v3.16-rc1-110-g3d09c62)
by Kevin's boot bot
Tree/Branch: mainline Git describe: v3.16-rc1-110-g3d09c62 Failed boot tests (console logs at the end) =========================================== ste-snowball: FAIL: arm-u8500_defconfig Full Report =========== arm-davinci_all_defconfig ------------------------- legacy,dm365evm 0 min 17.5 sec: PASS da850-evm 0 min 15.3 sec: PASS arm-tegra_defconfig ------------------- tegra124-jetson-tk1 0 min 17.7 sec: PASS tegra30-beaver 0 min 17.6 sec: PASS arm-multi_v7_defconfig+CONFIG_ARM_LPAE=y ---------------------------------------- tegra124-jetson-tk1 0 min 17.7 sec: PASS armada-xp-openblocks-ax3-4 0 min 24.1 sec: PASS omap5-uevm 1 min 39.3 sec: PASS (Warnings: 1) sun7i-a20-cubieboard2 0 min 13.0 sec: PASS arm-mvebu_v7_defconfig+CONFIG_CPU_BIG_ENDIAN=y ---------------------------------------------- armada-xp-openblocks-ax3-4 0 min 23.7 sec: PASS armada-370-mirabox 0 min 20.6 sec: PASS arm-omap2plus_defconfig ----------------------- legacy,3730xm 0 min 38.5 sec: PASS am335x-boneblack 0 min 22.3 sec: PASS omap3-beagle-xm 0 min 53.5 sec: PASS legacy,3530beagle 0 min 23.4 sec: PASS (Warnings: 1) omap4-panda 0 min 53.0 sec: PASS (Warnings: 1) omap3-overo-tobi 0 min 22.9 sec: PASS am335x-bone 0 min 24.0 sec: PASS omap3-overo-storm-tobi 0 min 25.0 sec: PASS omap5-uevm 0 min 53.0 sec: PASS (Warnings: 1) omap3-n900 0 min 17.4 sec: PASS legacy,n900 0 min 16.7 sec: PASS (Warnings: 1) omap4-panda-es 0 min 56.9 sec: PASS (Warnings: 1) legacy,3730storm 0 min 23.2 sec: PASS legacy,3530overo 0 min 21.5 sec: PASS (Warnings: 1) arm-multi_v7_defconfig ---------------------- imx6dl-wandboard,wand-solo 0 min 15.3 sec: PASS am335x-boneblack 0 min 22.0 sec: PASS sun7i-a20-cubieboard2 0 min 12.9 sec: PASS sun4i-a10-cubieboard 0 min 17.6 sec: PASS exynos5410-smdk5410 0 min 28.7 sec: PASS am335x-bone 0 min 23.7 sec: PASS tegra124-jetson-tk1 0 min 17.5 sec: PASS armada-370-mirabox 0 min 22.1 sec: PASS omap4-panda 0 min 56.4 sec: PASS (Warnings: 1) imx6q-wandboard 0 min 13.8 sec: PASS imx6dl-wandboard,wand-dual 0 min 15.3 sec: PASS ste-snowball 1 min 14.5 sec: PASS tegra30-beaver 0 min 21.4 sec: PASS omap3-n900 0 min 16.2 sec: PASS qcom-apq8074-dragonboard 0 min 19.3 sec: PASS bcm28155-ap 0 min 25.6 sec: PASS omap3-overo-tobi 0 min 22.2 sec: PASS omap3-overo-storm-tobi 0 min 24.3 sec: PASS omap3-beagle-xm 0 min 48.0 sec: PASS exynos5420-arndale-octa 0 min 39.9 sec: PASS armada-xp-openblocks-ax3-4 0 min 25.0 sec: PASS omap5-uevm 1 min 39.6 sec: PASS (Warnings: 1) omap4-panda-es 0 min 56.3 sec: PASS (Warnings: 1) exynos5250-arndale 0 min 31.1 sec: PASS arm-sunxi_defconfig ------------------- sun7i-a20-cubieboard2 0 min 11.9 sec: PASS sun4i-a10-cubieboard 0 min 11.6 sec: PASS arm-qcom_defconfig ------------------ qcom-apq8074-dragonboard 0 min 18.5 sec: PASS arm-bcm_defconfig ----------------- bcm28155-ap 0 min 22.0 sec: PASS arm-exynos_defconfig -------------------- exynos5420-arndale-octa 0 min 39.2 sec: PASS exynos5250-arndale 0 min 30.3 sec: PASS exynos5410-smdk5410 0 min 27.4 sec: PASS arm-imx_v6_v7_defconfig ----------------------- imx6dl-wandboard,wand-dual 0 min 15.8 sec: PASS imx6dl-wandboard,wand-solo 0 min 17.7 sec: PASS imx6q-wandboard 0 min 26.1 sec: PASS arm-u8500_defconfig ------------------- ste-snowball 1 min 53.9 sec: FAIL arm-multi_v7_defconfig+CONFIG_CPU_BIG_ENDIAN=y ---------------------------------------------- armada-xp-openblocks-ax3-4 0 min 27.0 sec: PASS armada-370-mirabox 0 min 22.5 sec: PASS arm-mvebu_v7_defconfig ---------------------- armada-xp-openblocks-ax3-4 0 min 22.7 sec: PASS armada-370-mirabox 0 min 20.6 sec: PASS arm-sama5_defconfig ------------------- sama5d35ek 0 min 25.6 sec: PASS (Warnings: 1) Console logs for failures ========================= arm-u8500_defconfig ------------------- ste-snowball: FAIL: last 40 lines of boot log: ---------------------------------------------- [ 3.513092] platform musb-hdrc.20.auto: Driver musb-hdrc requests probe deferral [ 3.521057] pinctrl-nomadik soc:pinctrl: pin GPIO256_AF28 already requested by a03e0000.usb_per5; cannot claim for musb-hdrc.20.auto [ 3.532989] pinctrl-nomadik soc:pinctrl: pin-256 (musb-hdrc.20.auto) status -22 [ 3.540283] pinctrl-nomadik soc:pinctrl: could not request pin 256 (GPIO256_AF28) from group usb_a_1 on device pinctrl-nomadik [ 3.551757] musb-ux500 musb-hdrc.20.auto: Error applying setting, reverse things back [ 3.560363] pinctrl-nomadik soc:pinctrl: pin GPIO256_AF28 already requested by a03e0000.usb_per5; cannot claim for musb-hdrc.21.auto [ 3.572296] pinctrl-nomadik soc:pinctrl: pin-256 (musb-hdrc.21.auto) status -22 [ 3.579589] pinctrl-nomadik soc:pinctrl: could not request pin 256 (GPIO256_AF28) from group usb_a_1 on device pinctrl-nomadik [ 3.591064] musb-hdrc musb-hdrc.21.auto: Error applying setting, reverse things back [ 3.598876] HS USB OTG: no transceiver configured [ 3.603607] musb-hdrc musb-hdrc.21.auto: musb_init_controller failed with status -517 [ 3.611450] platform musb-hdrc.21.auto: Driver musb-hdrc requests probe deferral [ 3.619384] pinctrl-nomadik soc:pinctrl: pin GPIO256_AF28 already requested by a03e0000.usb_per5; cannot claim for musb-hdrc.21.auto [ 3.631286] pinctrl-nomadik soc:pinctrl: pin-256 (musb-hdrc.21.auto) status -22 [ 3.638610] pinctrl-nomadik soc:pinctrl: could not request pin 256 (GPIO256_AF28) from group usb_a_1 on device pinctrl-nomadik [ 3.650085] musb-ux500 musb-hdrc.21.auto: Error applying setting, reverse things back [ 3.658660] pinctrl-nomadik soc:pinctrl: pin GPIO256_AF28 already requested by a03e0000.usb_per5; cannot claim for musb-hdrc.22.auto [ 3.670593] pinctrl-nomadik soc:pinctrl: pin-256 (musb-hdrc.22.auto) status -22 [ 3.677917] pinctrl-nomadik soc:pinctrl: could not request pin 256 (GPIO256_AF28) from group usb_a_1 on device pinctrl-nomadik [ 3.689392] musb-hdrc musb-hdrc.22.auto: Error applying setting, reverse things back [ 3.697204] HS USB OTG: no transceiver configured [ 3.701934] musb-hdrc musb-hdrc.22.auto: musb_init_controller failed with status -517 [ 3.709777] platform musb-hdrc.22.auto: Driver musb-hdrc requests probe deferral [ 3.717712] pinctrl-nomadik soc:pinctrl: pin GPIO256_AF28 already requested by a03e0000.usb_per5; cannot claim for musb-hdrc.22.auto [ 3.729644] pinctrl-nomadik soc:pinctrl: pin-256 (musb-hdrc.22.auto) status -22 [ 3.736968] pinctrl-nomadik soc:pinctrl: could not request pin 256 (GPIO256_AF28) from group usb_a_1 on device pinctrl-nomadik [ 3.748443] musb-ux500 musb-hdrc.22.auto: Error applying setting, reverse things back [ 3.757049] pinctrl-nomadik soc:pinctrl: pin GPIO256_AF28 already requested by a03e0000.usb_per5; cannot claim for musb-hdrc.23.auto [ 3.768951] pinctrl-nomadik soc:pinctrl: pin-256 (musb-hdrc.23.auto) status -22 [ 3.776275] pinctrl-nomadik soc:pinctrl: could not request pin 256 (GPIO256_AF28) from group usb_a_1 on device pinctrl-nomadik [ 3.787780] musb-hdrc musb-hdrc.23.auto: Error applying setting, reverse things back [ 3.795593] HS USB OTG: no transceiver configured [ 3.800292] musb-hdrc musb-hdrc.23.auto: musb_init_controller failed with status -517 [ 3.808135] platform musb-hdrc.23.auto: Driver musb-hdrc requests probe deferral [ 3.816101] pinctrl-nomadik soc:pinctrl: pin GPIO256_AF28 already requested by a03e0000.usb_per5; cannot claim for musb-hdrc.23.auto [ 3.828033] pinctrl-nomadik soc:pinctrl: pin-256 (musb-hdrc.23.auto) status -22 ~$off # PYBOOT: Exception: kernel: ERROR: failed to boot: <class 'pexpect.TIMEOUT'> # PYBOOT: Time: 113.90 seconds. # PYBOOT: Result: FAIL
10 years, 8 months
1
0
0
0
next boot: 64 boots: 62 pass, 2 fail (next-20140619)
by Kevin's boot bot
Tree/Branch: next Git describe: next-20140619 Failed boot tests (console logs at the end) =========================================== exynos5420-arndale-octa: FAIL: arm-exynos_defconfig ste-snowball: FAIL: arm-u8500_defconfig Full Report =========== arm-davinci_all_defconfig ------------------------- legacy,dm365evm 0 min 17.1 sec: PASS da850-evm 0 min 15.0 sec: PASS arm-tegra_defconfig ------------------- tegra124-jetson-tk1 0 min 17.8 sec: PASS tegra30-beaver 0 min 17.4 sec: PASS arm-multi_v7_defconfig+CONFIG_ARM_LPAE=y ---------------------------------------- tegra124-jetson-tk1 0 min 17.8 sec: PASS armada-xp-openblocks-ax3-4 0 min 24.3 sec: PASS omap5-uevm 1 min 42.0 sec: PASS (Warnings: 1) sun7i-a20-cubieboard2 0 min 13.2 sec: PASS (Warnings: 1) arm-mvebu_v7_defconfig+CONFIG_CPU_BIG_ENDIAN=y ---------------------------------------------- armada-xp-openblocks-ax3-4 0 min 23.8 sec: PASS armada-370-mirabox 0 min 20.6 sec: PASS arm-omap2plus_defconfig ----------------------- legacy,3730xm 0 min 38.2 sec: PASS am335x-boneblack 0 min 22.4 sec: PASS omap3-beagle-xm 0 min 50.4 sec: PASS legacy,3530beagle 0 min 28.9 sec: PASS (Warnings: 1) omap4-panda 0 min 53.6 sec: PASS (Warnings: 1) omap3-overo-tobi 0 min 23.1 sec: PASS am335x-bone 0 min 28.9 sec: PASS omap3-overo-storm-tobi 0 min 24.3 sec: PASS omap5-uevm 0 min 58.7 sec: PASS (Warnings: 1) omap3-n900 0 min 17.4 sec: PASS legacy,n900 0 min 17.4 sec: PASS (Warnings: 2) omap4-panda-es 0 min 53.4 sec: PASS (Warnings: 1) legacy,3730storm 0 min 22.5 sec: PASS legacy,3530overo 0 min 21.0 sec: PASS (Warnings: 1) arm-multi_v7_defconfig ---------------------- imx6dl-wandboard,wand-solo 0 min 15.4 sec: PASS (Warnings: 1) am335x-boneblack 0 min 22.1 sec: PASS sun7i-a20-cubieboard2 0 min 12.9 sec: PASS (Warnings: 1) sun4i-a10-cubieboard 0 min 20.5 sec: PASS exynos5410-smdk5410 0 min 29.1 sec: PASS (Warnings: 3) am335x-bone 0 min 28.6 sec: PASS tegra124-jetson-tk1 0 min 17.8 sec: PASS armada-370-mirabox 0 min 21.7 sec: PASS omap4-panda 0 min 54.4 sec: PASS (Warnings: 1) imx6q-wandboard 0 min 14.0 sec: PASS imx6dl-wandboard,wand-dual 0 min 15.3 sec: PASS ste-snowball 1 min 11.7 sec: PASS tegra30-beaver 0 min 19.7 sec: PASS omap3-n900 0 min 16.5 sec: PASS qcom-apq8074-dragonboard 0 min 18.7 sec: PASS bcm28155-ap 0 min 27.4 sec: PASS omap3-overo-tobi 0 min 22.3 sec: PASS omap3-overo-storm-tobi 0 min 23.9 sec: PASS omap3-beagle-xm 0 min 54.3 sec: PASS exynos5420-arndale-octa 0 min 43.1 sec: PASS (Warnings: 7) armada-xp-openblocks-ax3-4 0 min 25.0 sec: PASS omap5-uevm 1 min 41.6 sec: PASS (Warnings: 1) omap4-panda-es 0 min 52.9 sec: PASS (Warnings: 1) exynos5250-arndale 0 min 30.9 sec: PASS arm-sunxi_defconfig ------------------- sun7i-a20-cubieboard2 0 min 11.8 sec: PASS (Warnings: 1) sun4i-a10-cubieboard 0 min 11.6 sec: PASS arm-qcom_defconfig ------------------ qcom-apq8074-dragonboard 0 min 18.4 sec: PASS arm-bcm_defconfig ----------------- bcm28155-ap 0 min 22.7 sec: PASS arm-exynos_defconfig -------------------- exynos5420-arndale-octa 0 min 38.4 sec: FAIL (Warnings: 7) exynos5250-arndale 0 min 30.2 sec: PASS exynos5410-smdk5410 0 min 27.7 sec: PASS (Warnings: 3) arm-imx_v6_v7_defconfig ----------------------- imx6dl-wandboard,wand-dual 0 min 15.4 sec: PASS imx6dl-wandboard,wand-solo 0 min 15.5 sec: PASS (Warnings: 1) imx6q-wandboard 0 min 14.1 sec: PASS arm-u8500_defconfig ------------------- ste-snowball 1 min 50.5 sec: FAIL arm-multi_v7_defconfig+CONFIG_CPU_BIG_ENDIAN=y ---------------------------------------------- armada-xp-openblocks-ax3-4 0 min 26.7 sec: PASS armada-370-mirabox 0 min 23.3 sec: PASS arm-mvebu_v7_defconfig ---------------------- armada-xp-openblocks-ax3-4 0 min 22.3 sec: PASS armada-370-mirabox 0 min 20.2 sec: PASS arm-sama5_defconfig ------------------- sama5d35ek 1 min 46.0 sec: PASS (Warnings: 1) Console logs for failures ========================= arm-exynos_defconfig -------------------- exynos5420-arndale-octa: FAIL: last 40 lines of boot log: --------------------------------------------------------- [ 17.201588] mmcblk0: p1 p2 p3 p4 [ 17.204756] Unhandled fault: external abort on non-linefetch (0x008) at 0xf00bc088 [ 17.212294] Internal error: : 8 [#2] PREEMPT SMP ARM [ 17.217231] Modules linked in: [ 17.220267] CPU: 0 PID: 6 Comm: kworker/u16:0 Tainted: G D W 3.16.0-rc1-next-20140619 #1 [ 17.229111] Workqueue: kmmcd mmc_rescan [ 17.232917] task: ef014000 ti: ef0b4000 task.ti: ef0b4000 [ 17.238295] PC is at rescan_partitions+0xb4/0x290 [ 17.242969] LR is at 0xf00bc000 [ 17.246089] pc : [<c01b0648>] lr : [<f00bc000>] psr: 20000113 [ 17.246089] sp : ef0b5c80 ip : 00000000 fp : 00000000 [ 17.257526] r10: 00000000 r9 : ed582400 r8 : ed4cc200 [ 17.262725] r7 : 00000000 r6 : eec24280 r5 : 00000000 r4 : 00000008 [ 17.269223] r3 : 00000013 r2 : 00000000 r1 : 00000000 r0 : 00000001 [ 17.275724] Flags: nzCv IRQs on FIQs on Mode SVC_32 ISA ARM Segment kernel [ 17.283002] Control: 10c5387d Table: 2000406a DAC: 00000015 [ 17.288721] Process kworker/u16:0 (pid: 6, stack limit = 0xef0b4240) [ 17.295047] Stack: (0xef0b5c80 to 0xef0b6000) [ 17.299382] 5c80: c054b37c 00000001 ef0b4000 c038b250 00000001 c0526578 ed717598 c0526448 [ 17.307528] 5ca0: eec24380 ed717468 eec24330 eec24280 00000000 ed717468 00000000 00000000 [ 17.315673] 5cc0: 00000000 eec24280 ed4cc200 eec24290 00000001 00000000 00000000 c00e3e04 [ 17.323818] 5ce0: c00e2804 00000000 00000000 00000001 eec24280 00000000 ed4cc270 ed4cc20c [ 17.331964] 5d00: 00000000 ed717380 00000003 c00e4068 c0528794 00000001 00000003 c038c6f0 [ 17.340109] 5d20: c0528794 c00e2d7c ef0b5d34 c0223228 ed4cc240 00000001 eec24280 ed4cc200 [ 17.348254] 5d40: ed4cc270 ed4cc20c 00000000 ed717380 00000003 c01ae560 c01ad3ac ed4cc200 [ 17.356400] 5d60: 00000080 0b300000 00000002 ef19e400 ef19d800 ef198800 ef198800 ef198abc [ 17.364546] 5d80: c02bccb4 ef19d800 ef198800 ef19d988 ef0b5dd6 c02bdbb8 00000056 ef19d86c [ 17.372691] 5da0: 00000003 ef19e400 ef19d800 c02be7e8 00000003 ef0b5dd6 00000008 ed5a0000 [ 17.380837] 5dc0: c046a178 ef198a98 00000000 34362e33 42694720 32310000 694b2038 c0000042 [ 17.388981] 5de0: 00000001 ef19d808 c058d0a8 00000000 c054b304 00000001 00000000 c054afb0 [ 17.397127] 5e00: ef013c00 c02b30fc c02b30e4 c0226ccc 00000000 ef19d808 c0226e7c ef19cc08 [ 17.405273] 5e20: 00000000 c02254a8 ef319698 ed555c44 ef19d808 ef19d83c c054aed0 c0226ba8 [ 17.413419] 5e40: ef19d808 ef19d808 c054aed0 c0226318 ef19d808 00000000 ef19d810 c0224980 [ 17.421564] 5e60: ef013c00 c03851c4 c047cddc ef0b5e84 00061a80 ef19d800 ef19d808 c047cd88 [ 17.429710] 5e80: 00061a80 c03b580c 00000000 c02b351c c047cd88 c045488c c047cd44 00000001 [ 17.437855] 5ea0: ef19cc00 00000000 ef19cc00 c02b5f84 00061a80 40ff8080 00000000 ef19cde~$off # PYBOOT: Exception: kernel: ERROR: failed to boot: Unhandled fault # PYBOOT: Time: 38.42 seconds. # PYBOOT: Warnings: 7 # PYBOOT: Result: FAIL arm-u8500_defconfig ------------------- ste-snowball: FAIL: last 40 lines of boot log: ---------------------------------------------- [ 3.503814] musb-hdrc musb-hdrc.20.auto: musb_init_controller failed with status -517 [ 3.511688] platform musb-hdrc.20.auto: Driver musb-hdrc requests probe deferral [ 3.519592] pinctrl-nomadik soc:pinctrl: pin GPIO256_AF28 already requested by a03e0000.usb_per5; cannot claim for musb-hdrc.20.auto [ 3.531524] pinctrl-nomadik soc:pinctrl: pin-256 (musb-hdrc.20.auto) status -22 [ 3.538818] pinctrl-nomadik soc:pinctrl: could not request pin 256 (GPIO256_AF28) from group usb_a_1 on device pinctrl-nomadik [ 3.550292] musb-ux500 musb-hdrc.20.auto: Error applying setting, reverse things back [ 3.558837] pinctrl-nomadik soc:pinctrl: pin GPIO256_AF28 already requested by a03e0000.usb_per5; cannot claim for musb-hdrc.21.auto [ 3.570770] pinctrl-nomadik soc:pinctrl: pin-256 (musb-hdrc.21.auto) status -22 [ 3.578063] pinctrl-nomadik soc:pinctrl: could not request pin 256 (GPIO256_AF28) from group usb_a_1 on device pinctrl-nomadik [ 3.589569] musb-hdrc musb-hdrc.21.auto: Error applying setting, reverse things back [ 3.597381] HS USB OTG: no transceiver configured [ 3.602081] musb-hdrc musb-hdrc.21.auto: musb_init_controller failed with status -517 [ 3.609924] platform musb-hdrc.21.auto: Driver musb-hdrc requests probe deferral [ 3.617858] pinctrl-nomadik soc:pinctrl: pin GPIO256_AF28 already requested by a03e0000.usb_per5; cannot claim for musb-hdrc.21.auto [ 3.629791] pinctrl-nomadik soc:pinctrl: pin-256 (musb-hdrc.21.auto) status -22 [ 3.637115] pinctrl-nomadik soc:pinctrl: could not request pin 256 (GPIO256_AF28) from group usb_a_1 on device pinctrl-nomadik [ 3.648590] musb-ux500 musb-hdrc.21.auto: Error applying setting, reverse things back [ 3.657104] pinctrl-nomadik soc:pinctrl: pin GPIO256_AF28 already requested by a03e0000.usb_per5; cannot claim for musb-hdrc.22.auto [ 3.669036] pinctrl-nomadik soc:pinctrl: pin-256 (musb-hdrc.22.auto) status -22 [ 3.676361] pinctrl-nomadik soc:pinctrl: could not request pin 256 (GPIO256_AF28) from group usb_a_1 on device pinctrl-nomadik [ 3.687835] musb-hdrc musb-hdrc.22.auto: Error applying setting, reverse things back [ 3.695678] HS USB OTG: no transceiver configured [ 3.700378] musb-hdrc musb-hdrc.22.auto: musb_init_controller failed with status -517 [ 3.708221] platform musb-hdrc.22.auto: Driver musb-hdrc requests probe deferral [ 3.716156] pinctrl-nomadik soc:pinctrl: pin GPIO256_AF28 already requested by a03e0000.usb_per5; cannot claim for musb-hdrc.22.auto [ 3.728088] pinctrl-nomadik soc:pinctrl: pin-256 (musb-hdrc.22.auto) status -22 [ 3.735412] pinctrl-nomadik soc:pinctrl: could not request pin 256 (GPIO256_AF28) from group usb_a_1 on device pinctrl-nomadik [ 3.746887] musb-ux500 musb-hdrc.22.auto: Error applying setting, reverse things back [ 3.755432] pinctrl-nomadik soc:pinctrl: pin GPIO256_AF28 already requested by a03e0000.usb_per5; cannot claim for musb-hdrc.23.auto [ 3.767333] pinctrl-nomadik soc:pinctrl: pin-256 (musb-hdrc.23.auto) status -22 [ 3.774658] pinctrl-nomadik soc:pinctrl: could not request pin 256 (GPIO256_AF28) from group usb_a_1 on device pinctrl-nomadik [ 3.786132] musb-hdrc musb-hdrc.23.auto: Error applying setting, reverse things back [ 3.793975] HS USB OTG: no transceiver configured [ 3.798675] musb-hdrc musb-hdrc.23.auto: musb_init_controller failed with status -517 [ 3.806518] platform musb-hdrc.23.auto: Driver musb-hdrc requests probe deferral [ 3.814453] pinctrl-nomadik soc:pinctrl: pin GPIO256_AF28 already requested by a03e0000.usb_per5; cannot claim for musb-hdrc.23.auto ~$off # PYBOOT: Exception: kernel: ERROR: failed to boot: <class 'pexpect.TIMEOUT'> # PYBOOT: Time: 110.52 seconds. # PYBOOT: Result: FAIL
10 years, 8 months
1
0
0
0
← Newer
1
...
5
6
7
8
9
10
11
...
23
Older →
Jump to page:
1
2
3
4
5
6
7
8
9
10
11
12
13
14
15
16
17
18
19
20
21
22
23
Results per page:
10
25
50
100
200