lists.linaro.org
Sign In
Sign Up
Sign In
Sign Up
Manage this list
×
Keyboard Shortcuts
Thread View
j
: Next unread message
k
: Previous unread message
j a
: Jump to all threads
j l
: Jump to MailingList overview
2024
December
November
October
September
August
July
June
May
April
March
February
January
2023
December
November
October
September
August
July
June
May
April
March
February
January
2022
December
November
October
September
August
July
June
May
April
March
February
January
2021
December
November
October
September
August
July
June
May
April
March
February
January
2020
December
November
October
September
August
July
June
May
April
March
February
January
2019
December
November
October
September
August
July
June
May
April
March
February
January
2018
December
November
October
September
August
July
June
May
April
March
February
January
2017
December
November
October
September
August
July
June
May
April
March
February
January
2016
December
November
October
September
August
July
June
May
April
March
February
January
2015
December
November
October
September
August
July
June
May
April
March
February
January
2014
December
November
October
September
August
July
June
May
April
March
February
January
2013
December
November
October
September
August
July
June
May
April
March
February
January
2012
December
November
October
September
August
July
June
May
April
March
February
January
2011
December
November
October
September
August
July
June
May
April
March
February
List overview
Download
linaro-kernel
November 2017
----- 2024 -----
December 2024
November 2024
October 2024
September 2024
August 2024
July 2024
June 2024
May 2024
April 2024
March 2024
February 2024
January 2024
----- 2023 -----
December 2023
November 2023
October 2023
September 2023
August 2023
July 2023
June 2023
May 2023
April 2023
March 2023
February 2023
January 2023
----- 2022 -----
December 2022
November 2022
October 2022
September 2022
August 2022
July 2022
June 2022
May 2022
April 2022
March 2022
February 2022
January 2022
----- 2021 -----
December 2021
November 2021
October 2021
September 2021
August 2021
July 2021
June 2021
May 2021
April 2021
March 2021
February 2021
January 2021
----- 2020 -----
December 2020
November 2020
October 2020
September 2020
August 2020
July 2020
June 2020
May 2020
April 2020
March 2020
February 2020
January 2020
----- 2019 -----
December 2019
November 2019
October 2019
September 2019
August 2019
July 2019
June 2019
May 2019
April 2019
March 2019
February 2019
January 2019
----- 2018 -----
December 2018
November 2018
October 2018
September 2018
August 2018
July 2018
June 2018
May 2018
April 2018
March 2018
February 2018
January 2018
----- 2017 -----
December 2017
November 2017
October 2017
September 2017
August 2017
July 2017
June 2017
May 2017
April 2017
March 2017
February 2017
January 2017
----- 2016 -----
December 2016
November 2016
October 2016
September 2016
August 2016
July 2016
June 2016
May 2016
April 2016
March 2016
February 2016
January 2016
----- 2015 -----
December 2015
November 2015
October 2015
September 2015
August 2015
July 2015
June 2015
May 2015
April 2015
March 2015
February 2015
January 2015
----- 2014 -----
December 2014
November 2014
October 2014
September 2014
August 2014
July 2014
June 2014
May 2014
April 2014
March 2014
February 2014
January 2014
----- 2013 -----
December 2013
November 2013
October 2013
September 2013
August 2013
July 2013
June 2013
May 2013
April 2013
March 2013
February 2013
January 2013
----- 2012 -----
December 2012
November 2012
October 2012
September 2012
August 2012
July 2012
June 2012
May 2012
April 2012
March 2012
February 2012
January 2012
----- 2011 -----
December 2011
November 2011
October 2011
September 2011
August 2011
July 2011
June 2011
May 2011
April 2011
March 2011
February 2011
linaro-kernel@lists.linaro.org
3 participants
128 discussions
Start a n
N
ew thread
v3.18.81 build: 0 failures 1 warnings (v3.18.81)
by Build bot for Mark Brown
Tree/Branch: v3.18.81 Git describe: v3.18.81 Commit: 37cdf96914 Linux 3.18.81 Build Time: 54 min 54 sec Passed: 9 / 9 (100.00 %) Failed: 0 / 9 ( 0.00 %) Errors: 0 Warnings: 1 Section Mismatches: 0 ------------------------------------------------------------------------------- defconfigs with issues (other than build errors): 2 warnings 0 mismatches : x86_64-defconfig ------------------------------------------------------------------------------- Warnings Summary: 1 2 ../include/linux/ftrace.h:632:36: warning: calling '__builtin_return_address' with a nonzero argument is unsafe [-Wframe-address] =============================================================================== Detailed per-defconfig build reports below: ------------------------------------------------------------------------------- x86_64-defconfig : PASS, 0 errors, 2 warnings, 0 section mismatches Warnings: ../include/linux/ftrace.h:632:36: warning: calling '__builtin_return_address' with a nonzero argument is unsafe [-Wframe-address] ../include/linux/ftrace.h:632:36: warning: calling '__builtin_return_address' with a nonzero argument is unsafe [-Wframe-address] ------------------------------------------------------------------------------- Passed with no errors, warnings or mismatches: arm64-allnoconfig arm64-allmodconfig arm-multi_v5_defconfig arm-multi_v7_defconfig arm-allmodconfig arm-allnoconfig x86_64-allnoconfig arm64-defconfig close failed in file object destructor: sys.excepthook is missing lost sys.stderr
7 years, 1 month
1
0
0
0
next-20171115 build: 1 failures 5 warnings (next-20171115)
by Build bot for Mark Brown
Tree/Branch: next-20171115 Git describe: next-20171115 Commit: 63fb091c80 Add linux-next specific files for 20171115 Build Time: 100 min 33 sec Passed: 9 / 10 ( 90.00 %) Failed: 1 / 10 ( 10.00 %) Errors: 1 Warnings: 5 Section Mismatches: 0 Failed defconfigs: arm-allmodconfig Errors: arm-allmodconfig ERROR: "__aeabi_ldivmod" [net/sched/sch_netem.ko] undefined! ------------------------------------------------------------------------------- defconfigs with issues (other than build errors): 2 warnings 0 mismatches : arm64-allnoconfig 6 warnings 0 mismatches : arm64-allmodconfig 2 warnings 0 mismatches : x86_64-defconfig 1 warnings 0 mismatches : arm-allmodconfig 6 warnings 0 mismatches : arm64-defconfig ------------------------------------------------------------------------------- Errors summary: 1 1 ERROR: "__aeabi_ldivmod" [net/sched/sch_netem.ko] undefined! Warnings Summary: 5 5 <stdin>:1335:2: warning: #warning syscall cpu_opv not implemented [-Wcpp] 5 <stdin>:1332:2: warning: #warning syscall rseq not implemented [-Wcpp] 3 ../include/linux/nodemask.h:107:69: warning: the address of 'nodes' will always evaluate as 'true' [-Waddress] 3 ../include/linux/nodemask.h:107:41: warning: the address of 'nodes' will always evaluate as 'true' [-Waddress] 1 ../fs/btrfs/tree-checker.c:273:3: warning: format '%lu' expects argument of type 'long unsigned int', but argument 5 has type 'u32 {aka unsigned int}' [-Wformat=] =============================================================================== Detailed per-defconfig build reports below: ------------------------------------------------------------------------------- arm64-allnoconfig : PASS, 0 errors, 2 warnings, 0 section mismatches Warnings: <stdin>:1332:2: warning: #warning syscall rseq not implemented [-Wcpp] <stdin>:1335:2: warning: #warning syscall cpu_opv not implemented [-Wcpp] ------------------------------------------------------------------------------- arm64-allmodconfig : PASS, 0 errors, 6 warnings, 0 section mismatches Warnings: <stdin>:1332:2: warning: #warning syscall rseq not implemented [-Wcpp] <stdin>:1335:2: warning: #warning syscall cpu_opv not implemented [-Wcpp] ../include/linux/nodemask.h:107:41: warning: the address of 'nodes' will always evaluate as 'true' [-Waddress] ../include/linux/nodemask.h:107:69: warning: the address of 'nodes' will always evaluate as 'true' [-Waddress] <stdin>:1332:2: warning: #warning syscall rseq not implemented [-Wcpp] <stdin>:1335:2: warning: #warning syscall cpu_opv not implemented [-Wcpp] ------------------------------------------------------------------------------- x86_64-defconfig : PASS, 0 errors, 2 warnings, 0 section mismatches Warnings: ../include/linux/nodemask.h:107:41: warning: the address of 'nodes' will always evaluate as 'true' [-Waddress] ../include/linux/nodemask.h:107:69: warning: the address of 'nodes' will always evaluate as 'true' [-Waddress] ------------------------------------------------------------------------------- arm-allmodconfig : FAIL, 1 errors, 1 warnings, 0 section mismatches Errors: ERROR: "__aeabi_ldivmod" [net/sched/sch_netem.ko] undefined! Warnings: ../fs/btrfs/tree-checker.c:273:3: warning: format '%lu' expects argument of type 'long unsigned int', but argument 5 has type 'u32 {aka unsigned int}' [-Wformat=] ------------------------------------------------------------------------------- arm64-defconfig : PASS, 0 errors, 6 warnings, 0 section mismatches Warnings: <stdin>:1332:2: warning: #warning syscall rseq not implemented [-Wcpp] <stdin>:1335:2: warning: #warning syscall cpu_opv not implemented [-Wcpp] ../include/linux/nodemask.h:107:41: warning: the address of 'nodes' will always evaluate as 'true' [-Waddress] ../include/linux/nodemask.h:107:69: warning: the address of 'nodes' will always evaluate as 'true' [-Waddress] <stdin>:1332:2: warning: #warning syscall rseq not implemented [-Wcpp] <stdin>:1335:2: warning: #warning syscall cpu_opv not implemented [-Wcpp] ------------------------------------------------------------------------------- Passed with no errors, warnings or mismatches: x86_64-allnoconfig arm-multi_v7_defconfig arm-allnoconfig arm-multi_v4t_defconfig arm-multi_v5_defconfig
7 years, 1 month
1
0
0
0
master build: 0 failures 1 warnings (v4.14-4050-g37cb8e1f8e10)
by Build bot for Mark Brown
Tree/Branch: master Git describe: v4.14-4050-g37cb8e1f8e10 Commit: 37cb8e1f8e Merge tag 'devicetree-for-4.15' of
git://git.kernel.org/pub/scm/linux/kernel/git/robh/linux
Build Time: 98 min 37 sec Passed: 10 / 10 (100.00 %) Failed: 0 / 10 ( 0.00 %) Errors: 0 Warnings: 1 Section Mismatches: 0 ------------------------------------------------------------------------------- defconfigs with issues (other than build errors): 1 warnings 0 mismatches : x86_64-allnoconfig ------------------------------------------------------------------------------- Warnings Summary: 1 1 warning: objtool: x86 instruction decoder differs from kernel =============================================================================== Detailed per-defconfig build reports below: ------------------------------------------------------------------------------- x86_64-allnoconfig : PASS, 0 errors, 1 warnings, 0 section mismatches Warnings: warning: objtool: x86 instruction decoder differs from kernel ------------------------------------------------------------------------------- Passed with no errors, warnings or mismatches: arm64-allnoconfig arm64-allmodconfig arm-multi_v5_defconfig arm-multi_v7_defconfig x86_64-defconfig arm-allmodconfig arm-allnoconfig arm-multi_v4t_defconfig arm64-defconfig close failed in file object destructor: sys.excepthook is missing lost sys.stderr
7 years, 1 month
1
0
0
0
master build: 0 failures 1 warnings (v4.14-2748-gabc36be23635)
by Build bot for Mark Brown
Tree/Branch: master Git describe: v4.14-2748-gabc36be23635 Commit: abc36be236 Merge tag 'configfs-for-4.15' of
git://git.infradead.org/users/hch/configfs
Build Time: 97 min 55 sec Passed: 10 / 10 (100.00 %) Failed: 0 / 10 ( 0.00 %) Errors: 0 Warnings: 1 Section Mismatches: 0 ------------------------------------------------------------------------------- defconfigs with issues (other than build errors): 1 warnings 0 mismatches : x86_64-allnoconfig ------------------------------------------------------------------------------- Warnings Summary: 1 1 warning: objtool: x86 instruction decoder differs from kernel =============================================================================== Detailed per-defconfig build reports below: ------------------------------------------------------------------------------- x86_64-allnoconfig : PASS, 0 errors, 1 warnings, 0 section mismatches Warnings: warning: objtool: x86 instruction decoder differs from kernel ------------------------------------------------------------------------------- Passed with no errors, warnings or mismatches: arm64-allnoconfig arm64-allmodconfig arm-multi_v5_defconfig arm-multi_v7_defconfig x86_64-defconfig arm-allmodconfig arm-allnoconfig arm-multi_v4t_defconfig arm64-defconfig close failed in file object destructor: sys.excepthook is missing lost sys.stderr
7 years, 1 month
1
0
0
0
master build: 2 failures 0 warnings (v4.14-2229-g894025f24bd0)
by Build bot for Mark Brown
Tree/Branch: master Git describe: v4.14-2229-g894025f24bd0 Commit: 894025f24b Merge tag 'usb-4.15-rc1' of
git://git.kernel.org/pub/scm/linux/kernel/git/gregkh/usb
Build Time: 97 min 50 sec Passed: 8 / 10 ( 80.00 %) Failed: 2 / 10 ( 20.00 %) Errors: 0 Warnings: 0 Section Mismatches: 0 Failed defconfigs: Errors: ------------------------------------------------------------------------------- defconfigs with issues (other than build errors): ------------------------------------------------------------------------------- =============================================================================== Detailed per-defconfig build reports below: ------------------------------------------------------------------------------- Passed with no errors, warnings or mismatches: arm64-allnoconfig arm64-allmodconfig arm-multi_v5_defconfig arm-multi_v7_defconfig x86_64-defconfig arm-allmodconfig arm-allnoconfig x86_64-allnoconfig arm-multi_v4t_defconfig arm64-defconfig close failed in file object destructor: sys.excepthook is missing lost sys.stderr
7 years, 1 month
1
0
0
0
next-20171114 build: 4 failures 5 warnings (next-20171114)
by Build bot for Mark Brown
Tree/Branch: next-20171114 Git describe: next-20171114 Commit: c9b945f2a7 Add linux-next specific files for 20171114 Build Time: 19 min 13 sec Passed: 6 / 10 ( 60.00 %) Failed: 4 / 10 ( 40.00 %) Errors: 1 Warnings: 5 Section Mismatches: 0 Failed defconfigs: arm64-allmodconfig x86_64-defconfig arm-allmodconfig x86_64-allnoconfig Errors: arm64-allmodconfig ../scripts/insert-sys-cert.c:28:18: fatal error: gelf.h: No such file or directory arm-allmodconfig ../scripts/insert-sys-cert.c:28:18: fatal error: gelf.h: No such file or directory ------------------------------------------------------------------------------- defconfigs with issues (other than build errors): 4 warnings 0 mismatches : arm64-allnoconfig 2 warnings 0 mismatches : arm64-allmodconfig 2 warnings 0 mismatches : arm-multi_v5_defconfig 2 warnings 0 mismatches : arm-multi_v7_defconfig 1 warnings 0 mismatches : x86_64-defconfig 2 warnings 0 mismatches : arm-allmodconfig 2 warnings 0 mismatches : arm-allnoconfig 2 warnings 0 mismatches : x86_64-allnoconfig 2 warnings 0 mismatches : arm-multi_v4t_defconfig 4 warnings 0 mismatches : arm64-defconfig ------------------------------------------------------------------------------- Errors summary: 1 2 ../scripts/insert-sys-cert.c:28:18: fatal error: gelf.h: No such file or directory Warnings Summary: 5 19 drivers/bluetooth/Kconfig:35:warning: multi-line strings not supported 1 ../include/linux/nodemask.h:107:69: warning: the address of 'nodes' will always evaluate as 'true' [-Waddress] 1 ../include/linux/nodemask.h:107:41: warning: the address of 'nodes' will always evaluate as 'true' [-Waddress] 1 ../include/linux/irqchip/arm-gic-v4.h:112:57: warning: its scope is only this definition or declaration, which is probably not what you want 1 ../include/linux/irqchip/arm-gic-v4.h:112:57: warning: 'struct irq_domain_ops' declared inside parameter list =============================================================================== Detailed per-defconfig build reports below: ------------------------------------------------------------------------------- arm64-allnoconfig : PASS, 0 errors, 4 warnings, 0 section mismatches Warnings: drivers/bluetooth/Kconfig:35:warning: multi-line strings not supported drivers/bluetooth/Kconfig:35:warning: multi-line strings not supported ../include/linux/irqchip/arm-gic-v4.h:112:57: warning: 'struct irq_domain_ops' declared inside parameter list ../include/linux/irqchip/arm-gic-v4.h:112:57: warning: its scope is only this definition or declaration, which is probably not what you want ------------------------------------------------------------------------------- arm64-allmodconfig : FAIL, 1 errors, 2 warnings, 0 section mismatches Errors: ../scripts/insert-sys-cert.c:28:18: fatal error: gelf.h: No such file or directory Warnings: drivers/bluetooth/Kconfig:35:warning: multi-line strings not supported drivers/bluetooth/Kconfig:35:warning: multi-line strings not supported ------------------------------------------------------------------------------- arm-multi_v5_defconfig : PASS, 0 errors, 2 warnings, 0 section mismatches Warnings: drivers/bluetooth/Kconfig:35:warning: multi-line strings not supported drivers/bluetooth/Kconfig:35:warning: multi-line strings not supported ------------------------------------------------------------------------------- arm-multi_v7_defconfig : PASS, 0 errors, 2 warnings, 0 section mismatches Warnings: drivers/bluetooth/Kconfig:35:warning: multi-line strings not supported drivers/bluetooth/Kconfig:35:warning: multi-line strings not supported ------------------------------------------------------------------------------- x86_64-defconfig : FAIL, 0 errors, 1 warnings, 0 section mismatches Warnings: drivers/bluetooth/Kconfig:35:warning: multi-line strings not supported ------------------------------------------------------------------------------- arm-allmodconfig : FAIL, 1 errors, 2 warnings, 0 section mismatches Errors: ../scripts/insert-sys-cert.c:28:18: fatal error: gelf.h: No such file or directory Warnings: drivers/bluetooth/Kconfig:35:warning: multi-line strings not supported drivers/bluetooth/Kconfig:35:warning: multi-line strings not supported ------------------------------------------------------------------------------- arm-allnoconfig : PASS, 0 errors, 2 warnings, 0 section mismatches Warnings: drivers/bluetooth/Kconfig:35:warning: multi-line strings not supported drivers/bluetooth/Kconfig:35:warning: multi-line strings not supported ------------------------------------------------------------------------------- x86_64-allnoconfig : FAIL, 0 errors, 2 warnings, 0 section mismatches Warnings: drivers/bluetooth/Kconfig:35:warning: multi-line strings not supported drivers/bluetooth/Kconfig:35:warning: multi-line strings not supported ------------------------------------------------------------------------------- arm-multi_v4t_defconfig : PASS, 0 errors, 2 warnings, 0 section mismatches Warnings: drivers/bluetooth/Kconfig:35:warning: multi-line strings not supported drivers/bluetooth/Kconfig:35:warning: multi-line strings not supported ------------------------------------------------------------------------------- arm64-defconfig : PASS, 0 errors, 4 warnings, 0 section mismatches Warnings: drivers/bluetooth/Kconfig:35:warning: multi-line strings not supported drivers/bluetooth/Kconfig:35:warning: multi-line strings not supported ../include/linux/nodemask.h:107:41: warning: the address of 'nodes' will always evaluate as 'true' [-Waddress] ../include/linux/nodemask.h:107:69: warning: the address of 'nodes' will always evaluate as 'true' [-Waddress] ------------------------------------------------------------------------------- Passed with no errors, warnings or mismatches:
7 years, 1 month
2
1
0
0
master build: 2 failures 0 warnings (v4.14-902-g43ff2f4db9d0)
by Build bot for Mark Brown
Tree/Branch: master Git describe: v4.14-902-g43ff2f4db9d0 Commit: 43ff2f4db9 Merge branch 'x86-platform-for-linus' of
git://git.kernel.org/pub/scm/linux/kernel/git/tip/tip
Build Time: 97 min 40 sec Passed: 8 / 10 ( 80.00 %) Failed: 2 / 10 ( 20.00 %) Errors: 0 Warnings: 0 Section Mismatches: 0 Failed defconfigs: Errors: ------------------------------------------------------------------------------- defconfigs with issues (other than build errors): ------------------------------------------------------------------------------- =============================================================================== Detailed per-defconfig build reports below: ------------------------------------------------------------------------------- Passed with no errors, warnings or mismatches: arm64-allnoconfig arm64-allmodconfig arm-multi_v5_defconfig arm-multi_v7_defconfig x86_64-defconfig arm-allmodconfig arm-allnoconfig x86_64-allnoconfig arm-multi_v4t_defconfig arm64-defconfig close failed in file object destructor: sys.excepthook is missing lost sys.stderr
7 years, 1 month
1
0
0
0
master build: 2 failures 0 warnings (v4.14-885-gd6ec9d9a4def)
by Build bot for Mark Brown
Tree/Branch: master Git describe: v4.14-885-gd6ec9d9a4def Commit: d6ec9d9a4d Merge branch 'x86-asm-for-linus' of
git://git.kernel.org/pub/scm/linux/kernel/git/tip/tip
Build Time: 97 min 39 sec Passed: 8 / 10 ( 80.00 %) Failed: 2 / 10 ( 20.00 %) Errors: 0 Warnings: 0 Section Mismatches: 0 Failed defconfigs: Errors: ------------------------------------------------------------------------------- defconfigs with issues (other than build errors): ------------------------------------------------------------------------------- =============================================================================== Detailed per-defconfig build reports below: ------------------------------------------------------------------------------- Passed with no errors, warnings or mismatches: arm64-allnoconfig arm64-allmodconfig arm-multi_v5_defconfig arm-multi_v7_defconfig x86_64-defconfig arm-allmodconfig arm-allnoconfig x86_64-allnoconfig arm-multi_v4t_defconfig arm64-defconfig close failed in file object destructor: sys.excepthook is missing lost sys.stderr
7 years, 1 month
1
0
0
0
master build: 0 failures 0 warnings (v4.14-540-g8e9a2dba8686)
by Build bot for Mark Brown
Tree/Branch: master Git describe: v4.14-540-g8e9a2dba8686 Commit: 8e9a2dba86 Merge branch 'locking-core-for-linus' of
git://git.kernel.org/pub/scm/linux/kernel/git/tip/tip
Build Time: 97 min 41 sec Passed: 10 / 10 (100.00 %) Failed: 0 / 10 ( 0.00 %) Errors: 0 Warnings: 0 Section Mismatches: 0 ------------------------------------------------------------------------------- defconfigs with issues (other than build errors): ------------------------------------------------------------------------------- =============================================================================== Detailed per-defconfig build reports below: ------------------------------------------------------------------------------- Passed with no errors, warnings or mismatches: arm64-allnoconfig arm64-allmodconfig arm-multi_v5_defconfig arm-multi_v7_defconfig x86_64-defconfig arm-allmodconfig arm-allnoconfig x86_64-allnoconfig arm-multi_v4t_defconfig arm64-defconfig close failed in file object destructor: sys.excepthook is missing lost sys.stderr
7 years, 1 month
1
0
0
0
master build: 0 failures 0 warnings (v4.14-104-g1e19bded7f5d)
by Build bot for Mark Brown
Tree/Branch: master Git describe: v4.14-104-g1e19bded7f5d Commit: 1e19bded7f Merge tag 'hwmon-for-linus-v4.15' of
git://git.kernel.org/pub/scm/linux/kernel/git/groeck/linux-staging
Build Time: 97 min 30 sec Passed: 10 / 10 (100.00 %) Failed: 0 / 10 ( 0.00 %) Errors: 0 Warnings: 0 Section Mismatches: 0 ------------------------------------------------------------------------------- defconfigs with issues (other than build errors): ------------------------------------------------------------------------------- =============================================================================== Detailed per-defconfig build reports below: ------------------------------------------------------------------------------- Passed with no errors, warnings or mismatches: arm64-allnoconfig arm64-allmodconfig arm-multi_v5_defconfig arm-multi_v7_defconfig x86_64-defconfig arm-allmodconfig arm-allnoconfig x86_64-allnoconfig arm-multi_v4t_defconfig arm64-defconfig close failed in file object destructor: sys.excepthook is missing lost sys.stderr
7 years, 1 month
1
0
0
0
← Newer
1
...
5
6
7
8
9
10
11
12
13
Older →
Jump to page:
1
2
3
4
5
6
7
8
9
10
11
12
13
Results per page:
10
25
50
100
200