lists.linaro.org
Sign In
Sign Up
Sign In
Sign Up
Manage this list
×
Keyboard Shortcuts
Thread View
j
: Next unread message
k
: Previous unread message
j a
: Jump to all threads
j l
: Jump to MailingList overview
2025
February
January
2024
December
November
October
September
August
July
June
May
April
March
February
January
2023
December
November
October
September
August
July
June
May
April
March
February
January
2022
December
November
October
September
August
July
June
May
April
March
February
January
2021
December
November
October
September
August
July
June
May
April
March
February
January
2020
December
November
October
September
August
July
June
May
April
March
February
January
2019
December
November
October
September
August
July
June
May
April
March
February
January
2018
December
November
October
September
August
July
June
May
April
March
February
January
2017
December
November
List overview
Download
Linux-stable-mirror
March 2023
----- 2025 -----
February 2025
January 2025
----- 2024 -----
December 2024
November 2024
October 2024
September 2024
August 2024
July 2024
June 2024
May 2024
April 2024
March 2024
February 2024
January 2024
----- 2023 -----
December 2023
November 2023
October 2023
September 2023
August 2023
July 2023
June 2023
May 2023
April 2023
March 2023
February 2023
January 2023
----- 2022 -----
December 2022
November 2022
October 2022
September 2022
August 2022
July 2022
June 2022
May 2022
April 2022
March 2022
February 2022
January 2022
----- 2021 -----
December 2021
November 2021
October 2021
September 2021
August 2021
July 2021
June 2021
May 2021
April 2021
March 2021
February 2021
January 2021
----- 2020 -----
December 2020
November 2020
October 2020
September 2020
August 2020
July 2020
June 2020
May 2020
April 2020
March 2020
February 2020
January 2020
----- 2019 -----
December 2019
November 2019
October 2019
September 2019
August 2019
July 2019
June 2019
May 2019
April 2019
March 2019
February 2019
January 2019
----- 2018 -----
December 2018
November 2018
October 2018
September 2018
August 2018
July 2018
June 2018
May 2018
April 2018
March 2018
February 2018
January 2018
----- 2017 -----
December 2017
November 2017
linux-stable-mirror@lists.linaro.org
449 participants
1887 discussions
Start a n
N
ew thread
stable-rc/queue/4.19 baseline: 139 runs, 23 regressions (v4.19.278-27-g4ae6f3fcabf8)
by kernelci.org bot
stable-rc/queue/4.19 baseline: 139 runs, 23 regressions (v4.19.278-27-g4ae6f3fcabf8) Regressions Summary ------------------- platform | arch | lab | compiler | defconfig | regressions ---------------------------+-------+---------------+----------+----------------------------+------------ beaglebone-black | arm | lab-broonie | gcc-10 | omap2plus_defconfig | 1 cubietruck | arm | lab-baylibre | gcc-10 | multi_v7_defconfig | 1 qemu_arm64-virt-gicv2 | arm64 | lab-baylibre | gcc-10 | defconfig | 1 qemu_arm64-virt-gicv2 | arm64 | lab-baylibre | gcc-10 | defconfig+arm64-chromebook | 1 qemu_arm64-virt-gicv2 | arm64 | lab-broonie | gcc-10 | defconfig | 1 qemu_arm64-virt-gicv2 | arm64 | lab-broonie | gcc-10 | defconfig+arm64-chromebook | 1 qemu_arm64-virt-gicv2-uefi | arm64 | lab-baylibre | gcc-10 | defconfig | 1 qemu_arm64-virt-gicv2-uefi | arm64 | lab-baylibre | gcc-10 | defconfig+arm64-chromebook | 1 qemu_arm64-virt-gicv2-uefi | arm64 | lab-broonie | gcc-10 | defconfig | 1 qemu_arm64-virt-gicv2-uefi | arm64 | lab-broonie | gcc-10 | defconfig+arm64-chromebook | 1 qemu_arm64-virt-gicv2-uefi | arm64 | lab-collabora | gcc-10 | defconfig+arm64-chromebook | 1 qemu_arm64-virt-gicv3 | arm64 | lab-baylibre | gcc-10 | defconfig | 1 qemu_arm64-virt-gicv3 | arm64 | lab-baylibre | gcc-10 | defconfig+arm64-chromebook | 1 qemu_arm64-virt-gicv3 | arm64 | lab-broonie | gcc-10 | defconfig | 1 qemu_arm64-virt-gicv3 | arm64 | lab-broonie | gcc-10 | defconfig+arm64-chromebook | 1 qemu_arm64-virt-gicv3 | arm64 | lab-collabora | gcc-10 | defconfig+arm64-chromebook | 1 qemu_arm64-virt-gicv3-uefi | arm64 | lab-baylibre | gcc-10 | defconfig | 1 qemu_arm64-virt-gicv3-uefi | arm64 | lab-baylibre | gcc-10 | defconfig+arm64-chromebook | 1 qemu_arm64-virt-gicv3-uefi | arm64 | lab-broonie | gcc-10 | defconfig | 1 qemu_arm64-virt-gicv3-uefi | arm64 | lab-broonie | gcc-10 | defconfig+arm64-chromebook | 1 qemu_arm64-virt-gicv3-uefi | arm64 | lab-collabora | gcc-10 | defconfig | 1 rk3399-gru-kevin | arm64 | lab-collabora | gcc-10 | defconfig+arm64-chromebook | 2 Details:
https://kernelci.org/test/job/stable-rc/branch/queue%2F4.19/kernel/v4.19.27…
Test: baseline Tree: stable-rc Branch: queue/4.19 Describe: v4.19.278-27-g4ae6f3fcabf8 URL:
https://git.kernel.org/pub/scm/linux/kernel/git/stable/linux-stable-rc.git
SHA: 4ae6f3fcabf8b0a13a286ce3e7fa27d05fc3b2fb Test Regressions ---------------- platform | arch | lab | compiler | defconfig | regressions ---------------------------+-------+---------------+----------+----------------------------+------------ beaglebone-black | arm | lab-broonie | gcc-10 | omap2plus_defconfig | 1 Details:
https://kernelci.org/test/plan/id/6417b8a437ad05c2278c863d
Results: 41 PASS, 10 FAIL, 1 SKIP Full config: omap2plus_defconfig Compiler: gcc-10 (arm-linux-gnueabihf-gcc (Debian 10.2.1-6) 10.2.1 20210110) Plain log:
https://storage.kernelci.org//stable-rc/queue-4.19/v4.19.278-27-g4ae6f3fcab…
HTML log:
https://storage.kernelci.org//stable-rc/queue-4.19/v4.19.278-27-g4ae6f3fcab…
Rootfs:
http://storage.kernelci.org/images/rootfs/buildroot/buildroot-baseline/2023…
* baseline.bootrr.deferred-probe-empty:
https://kernelci.org/test/case/id/6417b8a437ad05c2278c8672
failing since 0 day (last pass: v4.19.278-2-g53ebfb8e0caf, first fail: v4.19.278-16-g153f82de665b3) 2023-03-20T01:35:59.141389 + set +x<8>[ 18.786535] <LAVA_SIGNAL_ENDRUN 0_dmesg 189990_1.5.2.4.1> 2023-03-20T01:35:59.141748 2023-03-20T01:35:59.253951 / # # 2023-03-20T01:35:59.355851 export SHELL=/bin/sh 2023-03-20T01:35:59.356323 # 2023-03-20T01:35:59.457891 / # export SHELL=/bin/sh. /lava-189990/environment 2023-03-20T01:35:59.458525 2023-03-20T01:35:59.560185 / # . /lava-189990/environment/lava-189990/bin/lava-test-runner /lava-189990/1 2023-03-20T01:35:59.561054 2023-03-20T01:35:59.564952 / # /lava-189990/bin/lava-test-runner /lava-189990/1 ... (12 line(s) more) platform | arch | lab | compiler | defconfig | regressions ---------------------------+-------+---------------+----------+----------------------------+------------ cubietruck | arm | lab-baylibre | gcc-10 | multi_v7_defconfig | 1 Details:
https://kernelci.org/test/plan/id/6417b71eb762d2bcdd8c8681
Results: 5 PASS, 1 FAIL, 1 SKIP Full config: multi_v7_defconfig Compiler: gcc-10 (arm-linux-gnueabihf-gcc (Debian 10.2.1-6) 10.2.1 20210110) Plain log:
https://storage.kernelci.org//stable-rc/queue-4.19/v4.19.278-27-g4ae6f3fcab…
HTML log:
https://storage.kernelci.org//stable-rc/queue-4.19/v4.19.278-27-g4ae6f3fcab…
Rootfs:
http://storage.kernelci.org/images/rootfs/buildroot/buildroot-baseline/2023…
* baseline.bootrr.deferred-probe-empty:
https://kernelci.org/test/case/id/6417b71eb762d2bcdd8c868a
failing since 61 days (last pass: v4.19.269-9-gce7b59ec9d48, first fail: v4.19.269-521-g305d312d039a) 2023-03-20T01:29:36.294092 <8>[ 7.240091] <LAVA_SIGNAL_ENDRUN 0_dmesg 3427089_1.5.2.4.1> 2023-03-20T01:29:36.400504 / # # 2023-03-20T01:29:36.502046 export SHELL=/bin/sh 2023-03-20T01:29:36.502406 # 2023-03-20T01:29:36.603545 / # export SHELL=/bin/sh. /lava-3427089/environment 2023-03-20T01:29:36.603892 2023-03-20T01:29:36.705004 / # . /lava-3427089/environment/lava-3427089/bin/lava-test-runner /lava-3427089/1 2023-03-20T01:29:36.705537 2023-03-20T01:29:36.710216 / # /lava-3427089/bin/lava-test-runner /lava-3427089/1 2023-03-20T01:29:36.787669 + export 'TESTRUN_ID=1_bootrr' ... (11 line(s) more) platform | arch | lab | compiler | defconfig | regressions ---------------------------+-------+---------------+----------+----------------------------+------------ qemu_arm64-virt-gicv2 | arm64 | lab-baylibre | gcc-10 | defconfig | 1 Details:
https://kernelci.org/test/plan/id/6417b9ca210e85a4b58c862f
Results: 0 PASS, 1 FAIL, 0 SKIP Full config: defconfig Compiler: gcc-10 (aarch64-linux-gnu-gcc (Debian 10.2.1-6) 10.2.1 20210110) Plain log:
https://storage.kernelci.org//stable-rc/queue-4.19/v4.19.278-27-g4ae6f3fcab…
HTML log:
https://storage.kernelci.org//stable-rc/queue-4.19/v4.19.278-27-g4ae6f3fcab…
Rootfs:
http://storage.kernelci.org/images/rootfs/buildroot/buildroot-baseline/2023…
* baseline.login:
https://kernelci.org/test/case/id/6417b9ca210e85a4b58c8630
failing since 313 days (last pass: v4.19.241-58-g5e77acf6dbb6, first fail: v4.19.241-83-g0ec5709aa1da) platform | arch | lab | compiler | defconfig | regressions ---------------------------+-------+---------------+----------+----------------------------+------------ qemu_arm64-virt-gicv2 | arm64 | lab-baylibre | gcc-10 | defconfig+arm64-chromebook | 1 Details:
https://kernelci.org/test/plan/id/6417b9f3cb902cba978c863f
Results: 0 PASS, 1 FAIL, 0 SKIP Full config: defconfig+arm64-chromebook Compiler: gcc-10 (aarch64-linux-gnu-gcc (Debian 10.2.1-6) 10.2.1 20210110) Plain log:
https://storage.kernelci.org//stable-rc/queue-4.19/v4.19.278-27-g4ae6f3fcab…
HTML log:
https://storage.kernelci.org//stable-rc/queue-4.19/v4.19.278-27-g4ae6f3fcab…
Rootfs:
http://storage.kernelci.org/images/rootfs/buildroot/buildroot-baseline/2023…
* baseline.login:
https://kernelci.org/test/case/id/6417b9f3cb902cba978c8640
failing since 313 days (last pass: v4.19.241-58-g8b40d487da7e, first fail: v4.19.241-83-g0ec5709aa1da) platform | arch | lab | compiler | defconfig | regressions ---------------------------+-------+---------------+----------+----------------------------+------------ qemu_arm64-virt-gicv2 | arm64 | lab-broonie | gcc-10 | defconfig | 1 Details:
https://kernelci.org/test/plan/id/6417b9c80273dcf1738c8645
Results: 0 PASS, 1 FAIL, 0 SKIP Full config: defconfig Compiler: gcc-10 (aarch64-linux-gnu-gcc (Debian 10.2.1-6) 10.2.1 20210110) Plain log:
https://storage.kernelci.org//stable-rc/queue-4.19/v4.19.278-27-g4ae6f3fcab…
HTML log:
https://storage.kernelci.org//stable-rc/queue-4.19/v4.19.278-27-g4ae6f3fcab…
Rootfs:
http://storage.kernelci.org/images/rootfs/buildroot/buildroot-baseline/2023…
* baseline.login:
https://kernelci.org/test/case/id/6417b9c80273dcf1738c8646
failing since 313 days (last pass: v4.19.241-58-g5e77acf6dbb6, first fail: v4.19.241-83-g0ec5709aa1da) platform | arch | lab | compiler | defconfig | regressions ---------------------------+-------+---------------+----------+----------------------------+------------ qemu_arm64-virt-gicv2 | arm64 | lab-broonie | gcc-10 | defconfig+arm64-chromebook | 1 Details:
https://kernelci.org/test/plan/id/6417bb5a42ff1a7cf88c8653
Results: 0 PASS, 1 FAIL, 0 SKIP Full config: defconfig+arm64-chromebook Compiler: gcc-10 (aarch64-linux-gnu-gcc (Debian 10.2.1-6) 10.2.1 20210110) Plain log:
https://storage.kernelci.org//stable-rc/queue-4.19/v4.19.278-27-g4ae6f3fcab…
HTML log:
https://storage.kernelci.org//stable-rc/queue-4.19/v4.19.278-27-g4ae6f3fcab…
Rootfs:
http://storage.kernelci.org/images/rootfs/buildroot/buildroot-baseline/2023…
* baseline.login:
https://kernelci.org/test/case/id/6417bb5a42ff1a7cf88c8654
failing since 313 days (last pass: v4.19.241-58-g8b40d487da7e, first fail: v4.19.241-83-g0ec5709aa1da) platform | arch | lab | compiler | defconfig | regressions ---------------------------+-------+---------------+----------+----------------------------+------------ qemu_arm64-virt-gicv2-uefi | arm64 | lab-baylibre | gcc-10 | defconfig | 1 Details:
https://kernelci.org/test/plan/id/6417b9cb0273dcf1738c8652
Results: 0 PASS, 1 FAIL, 0 SKIP Full config: defconfig Compiler: gcc-10 (aarch64-linux-gnu-gcc (Debian 10.2.1-6) 10.2.1 20210110) Plain log:
https://storage.kernelci.org//stable-rc/queue-4.19/v4.19.278-27-g4ae6f3fcab…
HTML log:
https://storage.kernelci.org//stable-rc/queue-4.19/v4.19.278-27-g4ae6f3fcab…
Rootfs:
http://storage.kernelci.org/images/rootfs/buildroot/buildroot-baseline/2023…
* baseline.login:
https://kernelci.org/test/case/id/6417b9cb0273dcf1738c8653
failing since 313 days (last pass: v4.19.241-58-g5e77acf6dbb6, first fail: v4.19.241-83-g0ec5709aa1da) platform | arch | lab | compiler | defconfig | regressions ---------------------------+-------+---------------+----------+----------------------------+------------ qemu_arm64-virt-gicv2-uefi | arm64 | lab-baylibre | gcc-10 | defconfig+arm64-chromebook | 1 Details:
https://kernelci.org/test/plan/id/6417b9e1cb902cba978c8633
Results: 0 PASS, 1 FAIL, 0 SKIP Full config: defconfig+arm64-chromebook Compiler: gcc-10 (aarch64-linux-gnu-gcc (Debian 10.2.1-6) 10.2.1 20210110) Plain log:
https://storage.kernelci.org//stable-rc/queue-4.19/v4.19.278-27-g4ae6f3fcab…
HTML log:
https://storage.kernelci.org//stable-rc/queue-4.19/v4.19.278-27-g4ae6f3fcab…
Rootfs:
http://storage.kernelci.org/images/rootfs/buildroot/buildroot-baseline/2023…
* baseline.login:
https://kernelci.org/test/case/id/6417b9e1cb902cba978c8634
failing since 237 days (last pass: v4.19.230-58-gbd840138c177, first fail: v4.19.253-43-g91137b502cfbd) platform | arch | lab | compiler | defconfig | regressions ---------------------------+-------+---------------+----------+----------------------------+------------ qemu_arm64-virt-gicv2-uefi | arm64 | lab-broonie | gcc-10 | defconfig | 1 Details:
https://kernelci.org/test/plan/id/6417b9dc73a65d6ac68c863d
Results: 0 PASS, 1 FAIL, 0 SKIP Full config: defconfig Compiler: gcc-10 (aarch64-linux-gnu-gcc (Debian 10.2.1-6) 10.2.1 20210110) Plain log:
https://storage.kernelci.org//stable-rc/queue-4.19/v4.19.278-27-g4ae6f3fcab…
HTML log:
https://storage.kernelci.org//stable-rc/queue-4.19/v4.19.278-27-g4ae6f3fcab…
Rootfs:
http://storage.kernelci.org/images/rootfs/buildroot/buildroot-baseline/2023…
* baseline.login:
https://kernelci.org/test/case/id/6417b9dc73a65d6ac68c863e
failing since 313 days (last pass: v4.19.241-58-g5e77acf6dbb6, first fail: v4.19.241-83-g0ec5709aa1da) platform | arch | lab | compiler | defconfig | regressions ---------------------------+-------+---------------+----------+----------------------------+------------ qemu_arm64-virt-gicv2-uefi | arm64 | lab-broonie | gcc-10 | defconfig+arm64-chromebook | 1 Details:
https://kernelci.org/test/plan/id/6417bb308830116c778c869a
Results: 0 PASS, 1 FAIL, 0 SKIP Full config: defconfig+arm64-chromebook Compiler: gcc-10 (aarch64-linux-gnu-gcc (Debian 10.2.1-6) 10.2.1 20210110) Plain log:
https://storage.kernelci.org//stable-rc/queue-4.19/v4.19.278-27-g4ae6f3fcab…
HTML log:
https://storage.kernelci.org//stable-rc/queue-4.19/v4.19.278-27-g4ae6f3fcab…
Rootfs:
http://storage.kernelci.org/images/rootfs/buildroot/buildroot-baseline/2023…
* baseline.login:
https://kernelci.org/test/case/id/6417bb308830116c778c869b
failing since 237 days (last pass: v4.19.230-58-gbd840138c177, first fail: v4.19.253-43-g91137b502cfbd) platform | arch | lab | compiler | defconfig | regressions ---------------------------+-------+---------------+----------+----------------------------+------------ qemu_arm64-virt-gicv2-uefi | arm64 | lab-collabora | gcc-10 | defconfig+arm64-chromebook | 1 Details:
https://kernelci.org/test/plan/id/6417b9cc210e85a4b58c8642
Results: 0 PASS, 1 FAIL, 0 SKIP Full config: defconfig+arm64-chromebook Compiler: gcc-10 (aarch64-linux-gnu-gcc (Debian 10.2.1-6) 10.2.1 20210110) Plain log:
https://storage.kernelci.org//stable-rc/queue-4.19/v4.19.278-27-g4ae6f3fcab…
HTML log:
https://storage.kernelci.org//stable-rc/queue-4.19/v4.19.278-27-g4ae6f3fcab…
Rootfs:
http://storage.kernelci.org/images/rootfs/buildroot/buildroot-baseline/2023…
* baseline.login:
https://kernelci.org/test/case/id/6417b9cc210e85a4b58c8643
failing since 237 days (last pass: v4.19.230-58-gbd840138c177, first fail: v4.19.253-43-g91137b502cfbd) platform | arch | lab | compiler | defconfig | regressions ---------------------------+-------+---------------+----------+----------------------------+------------ qemu_arm64-virt-gicv3 | arm64 | lab-baylibre | gcc-10 | defconfig | 1 Details:
https://kernelci.org/test/plan/id/6417b9cd73a65d6ac68c8635
Results: 0 PASS, 1 FAIL, 0 SKIP Full config: defconfig Compiler: gcc-10 (aarch64-linux-gnu-gcc (Debian 10.2.1-6) 10.2.1 20210110) Plain log:
https://storage.kernelci.org//stable-rc/queue-4.19/v4.19.278-27-g4ae6f3fcab…
HTML log:
https://storage.kernelci.org//stable-rc/queue-4.19/v4.19.278-27-g4ae6f3fcab…
Rootfs:
http://storage.kernelci.org/images/rootfs/buildroot/buildroot-baseline/2023…
* baseline.login:
https://kernelci.org/test/case/id/6417b9cd73a65d6ac68c8636
failing since 313 days (last pass: v4.19.241-58-g5e77acf6dbb6, first fail: v4.19.241-83-g0ec5709aa1da) platform | arch | lab | compiler | defconfig | regressions ---------------------------+-------+---------------+----------+----------------------------+------------ qemu_arm64-virt-gicv3 | arm64 | lab-baylibre | gcc-10 | defconfig+arm64-chromebook | 1 Details:
https://kernelci.org/test/plan/id/6417b9e2cb902cba978c8636
Results: 0 PASS, 1 FAIL, 0 SKIP Full config: defconfig+arm64-chromebook Compiler: gcc-10 (aarch64-linux-gnu-gcc (Debian 10.2.1-6) 10.2.1 20210110) Plain log:
https://storage.kernelci.org//stable-rc/queue-4.19/v4.19.278-27-g4ae6f3fcab…
HTML log:
https://storage.kernelci.org//stable-rc/queue-4.19/v4.19.278-27-g4ae6f3fcab…
Rootfs:
http://storage.kernelci.org/images/rootfs/buildroot/buildroot-baseline/2023…
* baseline.login:
https://kernelci.org/test/case/id/6417b9e2cb902cba978c8637
failing since 237 days (last pass: v4.19.230-58-gbd840138c177, first fail: v4.19.253-43-g91137b502cfbd) platform | arch | lab | compiler | defconfig | regressions ---------------------------+-------+---------------+----------+----------------------------+------------ qemu_arm64-virt-gicv3 | arm64 | lab-broonie | gcc-10 | defconfig | 1 Details:
https://kernelci.org/test/plan/id/6417ba54c0f0b8cc8a8c8643
Results: 0 PASS, 1 FAIL, 0 SKIP Full config: defconfig Compiler: gcc-10 (aarch64-linux-gnu-gcc (Debian 10.2.1-6) 10.2.1 20210110) Plain log:
https://storage.kernelci.org//stable-rc/queue-4.19/v4.19.278-27-g4ae6f3fcab…
HTML log:
https://storage.kernelci.org//stable-rc/queue-4.19/v4.19.278-27-g4ae6f3fcab…
Rootfs:
http://storage.kernelci.org/images/rootfs/buildroot/buildroot-baseline/2023…
* baseline.login:
https://kernelci.org/test/case/id/6417ba54c0f0b8cc8a8c8644
failing since 313 days (last pass: v4.19.241-58-g5e77acf6dbb6, first fail: v4.19.241-83-g0ec5709aa1da) platform | arch | lab | compiler | defconfig | regressions ---------------------------+-------+---------------+----------+----------------------------+------------ qemu_arm64-virt-gicv3 | arm64 | lab-broonie | gcc-10 | defconfig+arm64-chromebook | 1 Details:
https://kernelci.org/test/plan/id/6417bb45b6d6dc0c358c865b
Results: 0 PASS, 1 FAIL, 0 SKIP Full config: defconfig+arm64-chromebook Compiler: gcc-10 (aarch64-linux-gnu-gcc (Debian 10.2.1-6) 10.2.1 20210110) Plain log:
https://storage.kernelci.org//stable-rc/queue-4.19/v4.19.278-27-g4ae6f3fcab…
HTML log:
https://storage.kernelci.org//stable-rc/queue-4.19/v4.19.278-27-g4ae6f3fcab…
Rootfs:
http://storage.kernelci.org/images/rootfs/buildroot/buildroot-baseline/2023…
* baseline.login:
https://kernelci.org/test/case/id/6417bb45b6d6dc0c358c865c
failing since 237 days (last pass: v4.19.230-58-gbd840138c177, first fail: v4.19.253-43-g91137b502cfbd) platform | arch | lab | compiler | defconfig | regressions ---------------------------+-------+---------------+----------+----------------------------+------------ qemu_arm64-virt-gicv3 | arm64 | lab-collabora | gcc-10 | defconfig+arm64-chromebook | 1 Details:
https://kernelci.org/test/plan/id/6417b9cd210e85a4b58c8648
Results: 0 PASS, 1 FAIL, 0 SKIP Full config: defconfig+arm64-chromebook Compiler: gcc-10 (aarch64-linux-gnu-gcc (Debian 10.2.1-6) 10.2.1 20210110) Plain log:
https://storage.kernelci.org//stable-rc/queue-4.19/v4.19.278-27-g4ae6f3fcab…
HTML log:
https://storage.kernelci.org//stable-rc/queue-4.19/v4.19.278-27-g4ae6f3fcab…
Rootfs:
http://storage.kernelci.org/images/rootfs/buildroot/buildroot-baseline/2023…
* baseline.login:
https://kernelci.org/test/case/id/6417b9cd210e85a4b58c8649
failing since 237 days (last pass: v4.19.230-58-gbd840138c177, first fail: v4.19.253-43-g91137b502cfbd) platform | arch | lab | compiler | defconfig | regressions ---------------------------+-------+---------------+----------+----------------------------+------------ qemu_arm64-virt-gicv3-uefi | arm64 | lab-baylibre | gcc-10 | defconfig | 1 Details:
https://kernelci.org/test/plan/id/6417b9cc73a65d6ac68c862f
Results: 0 PASS, 1 FAIL, 0 SKIP Full config: defconfig Compiler: gcc-10 (aarch64-linux-gnu-gcc (Debian 10.2.1-6) 10.2.1 20210110) Plain log:
https://storage.kernelci.org//stable-rc/queue-4.19/v4.19.278-27-g4ae6f3fcab…
HTML log:
https://storage.kernelci.org//stable-rc/queue-4.19/v4.19.278-27-g4ae6f3fcab…
Rootfs:
http://storage.kernelci.org/images/rootfs/buildroot/buildroot-baseline/2023…
* baseline.login:
https://kernelci.org/test/case/id/6417b9cc73a65d6ac68c8630
failing since 237 days (last pass: v4.19.230-58-gbd840138c177, first fail: v4.19.253-43-g91137b502cfbd) platform | arch | lab | compiler | defconfig | regressions ---------------------------+-------+---------------+----------+----------------------------+------------ qemu_arm64-virt-gicv3-uefi | arm64 | lab-baylibre | gcc-10 | defconfig+arm64-chromebook | 1 Details:
https://kernelci.org/test/plan/id/6417b9e0cb902cba978c8630
Results: 0 PASS, 1 FAIL, 0 SKIP Full config: defconfig+arm64-chromebook Compiler: gcc-10 (aarch64-linux-gnu-gcc (Debian 10.2.1-6) 10.2.1 20210110) Plain log:
https://storage.kernelci.org//stable-rc/queue-4.19/v4.19.278-27-g4ae6f3fcab…
HTML log:
https://storage.kernelci.org//stable-rc/queue-4.19/v4.19.278-27-g4ae6f3fcab…
Rootfs:
http://storage.kernelci.org/images/rootfs/buildroot/buildroot-baseline/2023…
* baseline.login:
https://kernelci.org/test/case/id/6417b9e0cb902cba978c8631
failing since 313 days (last pass: v4.19.241-58-g8b40d487da7e, first fail: v4.19.241-83-g0ec5709aa1da) platform | arch | lab | compiler | defconfig | regressions ---------------------------+-------+---------------+----------+----------------------------+------------ qemu_arm64-virt-gicv3-uefi | arm64 | lab-broonie | gcc-10 | defconfig | 1 Details:
https://kernelci.org/test/plan/id/6417b9f0cb902cba978c8639
Results: 0 PASS, 1 FAIL, 0 SKIP Full config: defconfig Compiler: gcc-10 (aarch64-linux-gnu-gcc (Debian 10.2.1-6) 10.2.1 20210110) Plain log:
https://storage.kernelci.org//stable-rc/queue-4.19/v4.19.278-27-g4ae6f3fcab…
HTML log:
https://storage.kernelci.org//stable-rc/queue-4.19/v4.19.278-27-g4ae6f3fcab…
Rootfs:
http://storage.kernelci.org/images/rootfs/buildroot/buildroot-baseline/2023…
* baseline.login:
https://kernelci.org/test/case/id/6417b9f0cb902cba978c863a
failing since 237 days (last pass: v4.19.230-58-gbd840138c177, first fail: v4.19.253-43-g91137b502cfbd) platform | arch | lab | compiler | defconfig | regressions ---------------------------+-------+---------------+----------+----------------------------+------------ qemu_arm64-virt-gicv3-uefi | arm64 | lab-broonie | gcc-10 | defconfig+arm64-chromebook | 1 Details:
https://kernelci.org/test/plan/id/6417ba7c370f6933f38c8635
Results: 0 PASS, 1 FAIL, 0 SKIP Full config: defconfig+arm64-chromebook Compiler: gcc-10 (aarch64-linux-gnu-gcc (Debian 10.2.1-6) 10.2.1 20210110) Plain log:
https://storage.kernelci.org//stable-rc/queue-4.19/v4.19.278-27-g4ae6f3fcab…
HTML log:
https://storage.kernelci.org//stable-rc/queue-4.19/v4.19.278-27-g4ae6f3fcab…
Rootfs:
http://storage.kernelci.org/images/rootfs/buildroot/buildroot-baseline/2023…
* baseline.login:
https://kernelci.org/test/case/id/6417ba7c370f6933f38c8636
failing since 313 days (last pass: v4.19.241-58-g8b40d487da7e, first fail: v4.19.241-83-g0ec5709aa1da) platform | arch | lab | compiler | defconfig | regressions ---------------------------+-------+---------------+----------+----------------------------+------------ qemu_arm64-virt-gicv3-uefi | arm64 | lab-collabora | gcc-10 | defconfig | 1 Details:
https://kernelci.org/test/plan/id/6417b990ebf12fc4aa8c8692
Results: 0 PASS, 1 FAIL, 0 SKIP Full config: defconfig Compiler: gcc-10 (aarch64-linux-gnu-gcc (Debian 10.2.1-6) 10.2.1 20210110) Plain log:
https://storage.kernelci.org//stable-rc/queue-4.19/v4.19.278-27-g4ae6f3fcab…
HTML log:
https://storage.kernelci.org//stable-rc/queue-4.19/v4.19.278-27-g4ae6f3fcab…
Rootfs:
http://storage.kernelci.org/images/rootfs/buildroot/buildroot-baseline/2023…
* baseline.login:
https://kernelci.org/test/case/id/6417b990ebf12fc4aa8c8693
failing since 237 days (last pass: v4.19.230-58-gbd840138c177, first fail: v4.19.253-43-g91137b502cfbd) platform | arch | lab | compiler | defconfig | regressions ---------------------------+-------+---------------+----------+----------------------------+------------ rk3399-gru-kevin | arm64 | lab-collabora | gcc-10 | defconfig+arm64-chromebook | 2 Details:
https://kernelci.org/test/plan/id/6417b8f3d059bdd0498c8675
Results: 77 PASS, 5 FAIL, 1 SKIP Full config: defconfig+arm64-chromebook Compiler: gcc-10 (aarch64-linux-gnu-gcc (Debian 10.2.1-6) 10.2.1 20210110) Plain log:
https://storage.kernelci.org//stable-rc/queue-4.19/v4.19.278-27-g4ae6f3fcab…
HTML log:
https://storage.kernelci.org//stable-rc/queue-4.19/v4.19.278-27-g4ae6f3fcab…
Rootfs:
http://storage.kernelci.org/images/rootfs/buildroot/buildroot-baseline/2023…
* baseline.bootrr.rockchip-usb2phy1-probed:
https://kernelci.org/test/case/id/6417b8f3d059bdd0498c867f
failing since 5 days (last pass: v4.19.275-252-gcb3c41fc75db9, first fail: v4.19.276-34-ge787294ce440f) 2023-03-20T01:37:44.365521 /lava-9692659/1/../bin/lava-test-case 2023-03-20T01:37:44.374982 <8>[ 37.288458] <LAVA_SIGNAL_TESTCASE TEST_CASE_ID=rockchip-usb2phy1-probed RESULT=fail> * baseline.bootrr.rockchip-usb2phy0-probed:
https://kernelci.org/test/case/id/6417b8f3d059bdd0498c8680
failing since 5 days (last pass: v4.19.275-252-gcb3c41fc75db9, first fail: v4.19.276-34-ge787294ce440f) 2023-03-20T01:37:43.344288 /lava-9692659/1/../bin/lava-test-case 2023-03-20T01:37:43.353400 <8>[ 36.266980] <LAVA_SIGNAL_TESTCASE TEST_CASE_ID=rockchip-usb2phy0-probed RESULT=fail>
1 year, 11 months
1
0
0
0
stable-rc/queue/4.14 baseline: 126 runs, 23 regressions (v4.14.310-24-g818792480c07)
by kernelci.org bot
stable-rc/queue/4.14 baseline: 126 runs, 23 regressions (v4.14.310-24-g818792480c07) Regressions Summary ------------------- platform | arch | lab | compiler | defconfig | regressions ---------------------------+--------+---------------+----------+------------------------------+------------ hp-x360-14-G1-sona | x86_64 | lab-collabora | gcc-10 | x86_64_defcon...6-chromebook | 1 meson-gxl-s905x-khadas-vim | arm64 | lab-baylibre | gcc-10 | defconfig | 1 meson8b-odroidc1 | arm | lab-baylibre | gcc-10 | multi_v7_defconfig | 1 qemu_arm64-virt-gicv2 | arm64 | lab-baylibre | gcc-10 | defconfig+arm64-chromebook | 1 qemu_arm64-virt-gicv2 | arm64 | lab-baylibre | gcc-10 | defconfig | 1 qemu_arm64-virt-gicv2 | arm64 | lab-broonie | gcc-10 | defconfig+arm64-chromebook | 1 qemu_arm64-virt-gicv2 | arm64 | lab-broonie | gcc-10 | defconfig | 1 qemu_arm64-virt-gicv2 | arm64 | lab-collabora | gcc-10 | defconfig+arm64-chromebook | 1 qemu_arm64-virt-gicv2 | arm64 | lab-collabora | gcc-10 | defconfig | 1 qemu_arm64-virt-gicv2-uefi | arm64 | lab-baylibre | gcc-10 | defconfig+arm64-chromebook | 1 qemu_arm64-virt-gicv2-uefi | arm64 | lab-baylibre | gcc-10 | defconfig | 1 qemu_arm64-virt-gicv2-uefi | arm64 | lab-broonie | gcc-10 | defconfig+arm64-chromebook | 1 qemu_arm64-virt-gicv2-uefi | arm64 | lab-broonie | gcc-10 | defconfig | 1 qemu_arm64-virt-gicv2-uefi | arm64 | lab-collabora | gcc-10 | defconfig | 1 qemu_arm64-virt-gicv3 | arm64 | lab-baylibre | gcc-10 | defconfig+arm64-chromebook | 1 qemu_arm64-virt-gicv3 | arm64 | lab-baylibre | gcc-10 | defconfig | 1 qemu_arm64-virt-gicv3 | arm64 | lab-broonie | gcc-10 | defconfig+arm64-chromebook | 1 qemu_arm64-virt-gicv3 | arm64 | lab-broonie | gcc-10 | defconfig | 1 qemu_arm64-virt-gicv3-uefi | arm64 | lab-baylibre | gcc-10 | defconfig+arm64-chromebook | 1 qemu_arm64-virt-gicv3-uefi | arm64 | lab-baylibre | gcc-10 | defconfig | 1 qemu_arm64-virt-gicv3-uefi | arm64 | lab-broonie | gcc-10 | defconfig+arm64-chromebook | 1 qemu_arm64-virt-gicv3-uefi | arm64 | lab-broonie | gcc-10 | defconfig | 1 qemu_arm64-virt-gicv3-uefi | arm64 | lab-collabora | gcc-10 | defconfig+arm64-chromebook | 1 Details:
https://kernelci.org/test/job/stable-rc/branch/queue%2F4.14/kernel/v4.14.31…
Test: baseline Tree: stable-rc Branch: queue/4.14 Describe: v4.14.310-24-g818792480c07 URL:
https://git.kernel.org/pub/scm/linux/kernel/git/stable/linux-stable-rc.git
SHA: 818792480c075370833128e06b9d56b1a69cac97 Test Regressions ---------------- platform | arch | lab | compiler | defconfig | regressions ---------------------------+--------+---------------+----------+------------------------------+------------ hp-x360-14-G1-sona | x86_64 | lab-collabora | gcc-10 | x86_64_defcon...6-chromebook | 1 Details:
https://kernelci.org/test/plan/id/6417b3f392e5caa5ac8c8632
Results: 0 PASS, 1 FAIL, 0 SKIP Full config: x86_64_defconfig+x86-chromebook Compiler: gcc-10 (gcc (Debian 10.2.1-6) 10.2.1 20210110) Plain log:
https://storage.kernelci.org//stable-rc/queue-4.14/v4.14.310-24-g818792480c…
HTML log:
https://storage.kernelci.org//stable-rc/queue-4.14/v4.14.310-24-g818792480c…
Rootfs:
http://storage.kernelci.org/images/rootfs/buildroot/buildroot-baseline/2023…
* baseline.login:
https://kernelci.org/test/case/id/6417b3f392e5caa5ac8c8633
failing since 4 days (last pass: v4.14.308-22-gb3edefd64b5f0, first fail: v4.14.308-24-ge21306554563) platform | arch | lab | compiler | defconfig | regressions ---------------------------+--------+---------------+----------+------------------------------+------------ meson-gxl-s905x-khadas-vim | arm64 | lab-baylibre | gcc-10 | defconfig | 1 Details:
https://kernelci.org/test/plan/id/6417b2ec9a42d9591f8c8642
Results: 0 PASS, 1 FAIL, 0 SKIP Full config: defconfig Compiler: gcc-10 (aarch64-linux-gnu-gcc (Debian 10.2.1-6) 10.2.1 20210110) Plain log:
https://storage.kernelci.org//stable-rc/queue-4.14/v4.14.310-24-g818792480c…
HTML log:
https://storage.kernelci.org//stable-rc/queue-4.14/v4.14.310-24-g818792480c…
Rootfs:
http://storage.kernelci.org/images/rootfs/buildroot/buildroot-baseline/2023…
* baseline.login:
https://kernelci.org/test/case/id/6417b2ec9a42d9591f8c8643
failing since 257 days (last pass: v4.14.285-35-g61a723f50c9f, first fail: v4.14.285-46-ga87318551bac) platform | arch | lab | compiler | defconfig | regressions ---------------------------+--------+---------------+----------+------------------------------+------------ meson8b-odroidc1 | arm | lab-baylibre | gcc-10 | multi_v7_defconfig | 1 Details:
https://kernelci.org/test/plan/id/6417b4b544dbecad6a8c8657
Results: 0 PASS, 1 FAIL, 0 SKIP Full config: multi_v7_defconfig Compiler: gcc-10 (arm-linux-gnueabihf-gcc (Debian 10.2.1-6) 10.2.1 20210110) Plain log:
https://storage.kernelci.org//stable-rc/queue-4.14/v4.14.310-24-g818792480c…
HTML log:
https://storage.kernelci.org//stable-rc/queue-4.14/v4.14.310-24-g818792480c…
Rootfs:
http://storage.kernelci.org/images/rootfs/buildroot/buildroot-baseline/2023…
* baseline.login:
https://kernelci.org/test/case/id/6417b4b544dbecad6a8c8658
failing since 399 days (last pass: v4.14.266-18-g18b83990eba9, first fail: v4.14.266-28-g7d44cfe0255d) platform | arch | lab | compiler | defconfig | regressions ---------------------------+--------+---------------+----------+------------------------------+------------ qemu_arm64-virt-gicv2 | arm64 | lab-baylibre | gcc-10 | defconfig+arm64-chromebook | 1 Details:
https://kernelci.org/test/plan/id/6417b2ea9a42d9591f8c863f
Results: 0 PASS, 1 FAIL, 0 SKIP Full config: defconfig+arm64-chromebook Compiler: gcc-10 (aarch64-linux-gnu-gcc (Debian 10.2.1-6) 10.2.1 20210110) Plain log:
https://storage.kernelci.org//stable-rc/queue-4.14/v4.14.310-24-g818792480c…
HTML log:
https://storage.kernelci.org//stable-rc/queue-4.14/v4.14.310-24-g818792480c…
Rootfs:
http://storage.kernelci.org/images/rootfs/buildroot/buildroot-baseline/2023…
* baseline.login:
https://kernelci.org/test/case/id/6417b2ea9a42d9591f8c8640
failing since 237 days (last pass: v4.14.267-41-g23609abc0d54, first fail: v4.14.289-19-g8ed326806c84) platform | arch | lab | compiler | defconfig | regressions ---------------------------+--------+---------------+----------+------------------------------+------------ qemu_arm64-virt-gicv2 | arm64 | lab-baylibre | gcc-10 | defconfig | 1 Details:
https://kernelci.org/test/plan/id/6417b329628f4d4c148c863b
Results: 0 PASS, 1 FAIL, 0 SKIP Full config: defconfig Compiler: gcc-10 (aarch64-linux-gnu-gcc (Debian 10.2.1-6) 10.2.1 20210110) Plain log:
https://storage.kernelci.org//stable-rc/queue-4.14/v4.14.310-24-g818792480c…
HTML log:
https://storage.kernelci.org//stable-rc/queue-4.14/v4.14.310-24-g818792480c…
Rootfs:
http://storage.kernelci.org/images/rootfs/buildroot/buildroot-baseline/2023…
* baseline.login:
https://kernelci.org/test/case/id/6417b329628f4d4c148c863c
failing since 237 days (last pass: v4.14.267-41-g23609abc0d54, first fail: v4.14.289-19-g8ed326806c84) platform | arch | lab | compiler | defconfig | regressions ---------------------------+--------+---------------+----------+------------------------------+------------ qemu_arm64-virt-gicv2 | arm64 | lab-broonie | gcc-10 | defconfig+arm64-chromebook | 1 Details:
https://kernelci.org/test/plan/id/6417b3ff92e5caa5ac8c8653
Results: 0 PASS, 1 FAIL, 0 SKIP Full config: defconfig+arm64-chromebook Compiler: gcc-10 (aarch64-linux-gnu-gcc (Debian 10.2.1-6) 10.2.1 20210110) Plain log:
https://storage.kernelci.org//stable-rc/queue-4.14/v4.14.310-24-g818792480c…
HTML log:
https://storage.kernelci.org//stable-rc/queue-4.14/v4.14.310-24-g818792480c…
Rootfs:
http://storage.kernelci.org/images/rootfs/buildroot/buildroot-baseline/2023…
* baseline.login:
https://kernelci.org/test/case/id/6417b3ff92e5caa5ac8c8654
failing since 237 days (last pass: v4.14.267-41-g23609abc0d54, first fail: v4.14.289-19-g8ed326806c84) platform | arch | lab | compiler | defconfig | regressions ---------------------------+--------+---------------+----------+------------------------------+------------ qemu_arm64-virt-gicv2 | arm64 | lab-broonie | gcc-10 | defconfig | 1 Details:
https://kernelci.org/test/plan/id/6417b541968e25741d8c8649
Results: 0 PASS, 1 FAIL, 0 SKIP Full config: defconfig Compiler: gcc-10 (aarch64-linux-gnu-gcc (Debian 10.2.1-6) 10.2.1 20210110) Plain log:
https://storage.kernelci.org//stable-rc/queue-4.14/v4.14.310-24-g818792480c…
HTML log:
https://storage.kernelci.org//stable-rc/queue-4.14/v4.14.310-24-g818792480c…
Rootfs:
http://storage.kernelci.org/images/rootfs/buildroot/buildroot-baseline/2023…
* baseline.login:
https://kernelci.org/test/case/id/6417b541968e25741d8c864a
failing since 237 days (last pass: v4.14.267-41-g23609abc0d54, first fail: v4.14.289-19-g8ed326806c84) platform | arch | lab | compiler | defconfig | regressions ---------------------------+--------+---------------+----------+------------------------------+------------ qemu_arm64-virt-gicv2 | arm64 | lab-collabora | gcc-10 | defconfig+arm64-chromebook | 1 Details:
https://kernelci.org/test/plan/id/6417b2c357c923b4bd8c863e
Results: 0 PASS, 1 FAIL, 0 SKIP Full config: defconfig+arm64-chromebook Compiler: gcc-10 (aarch64-linux-gnu-gcc (Debian 10.2.1-6) 10.2.1 20210110) Plain log:
https://storage.kernelci.org//stable-rc/queue-4.14/v4.14.310-24-g818792480c…
HTML log:
https://storage.kernelci.org//stable-rc/queue-4.14/v4.14.310-24-g818792480c…
Rootfs:
http://storage.kernelci.org/images/rootfs/buildroot/buildroot-baseline/2023…
* baseline.login:
https://kernelci.org/test/case/id/6417b2c357c923b4bd8c863f
failing since 237 days (last pass: v4.14.267-41-g23609abc0d54, first fail: v4.14.289-19-g8ed326806c84) platform | arch | lab | compiler | defconfig | regressions ---------------------------+--------+---------------+----------+------------------------------+------------ qemu_arm64-virt-gicv2 | arm64 | lab-collabora | gcc-10 | defconfig | 1 Details:
https://kernelci.org/test/plan/id/6417b2feb1910804028c8647
Results: 0 PASS, 1 FAIL, 0 SKIP Full config: defconfig Compiler: gcc-10 (aarch64-linux-gnu-gcc (Debian 10.2.1-6) 10.2.1 20210110) Plain log:
https://storage.kernelci.org//stable-rc/queue-4.14/v4.14.310-24-g818792480c…
HTML log:
https://storage.kernelci.org//stable-rc/queue-4.14/v4.14.310-24-g818792480c…
Rootfs:
http://storage.kernelci.org/images/rootfs/buildroot/buildroot-baseline/2023…
* baseline.login:
https://kernelci.org/test/case/id/6417b2feb1910804028c8648
failing since 237 days (last pass: v4.14.267-41-g23609abc0d54, first fail: v4.14.289-19-g8ed326806c84) platform | arch | lab | compiler | defconfig | regressions ---------------------------+--------+---------------+----------+------------------------------+------------ qemu_arm64-virt-gicv2-uefi | arm64 | lab-baylibre | gcc-10 | defconfig+arm64-chromebook | 1 Details:
https://kernelci.org/test/plan/id/6417b3149a42d9591f8c8675
Results: 0 PASS, 1 FAIL, 0 SKIP Full config: defconfig+arm64-chromebook Compiler: gcc-10 (aarch64-linux-gnu-gcc (Debian 10.2.1-6) 10.2.1 20210110) Plain log:
https://storage.kernelci.org//stable-rc/queue-4.14/v4.14.310-24-g818792480c…
HTML log:
https://storage.kernelci.org//stable-rc/queue-4.14/v4.14.310-24-g818792480c…
Rootfs:
http://storage.kernelci.org/images/rootfs/buildroot/buildroot-baseline/2023…
* baseline.login:
https://kernelci.org/test/case/id/6417b3149a42d9591f8c8676
failing since 313 days (last pass: v4.14.277-54-gf277f09f64f4, first fail: v4.14.277-75-g7a298ff98d4a) platform | arch | lab | compiler | defconfig | regressions ---------------------------+--------+---------------+----------+------------------------------+------------ qemu_arm64-virt-gicv2-uefi | arm64 | lab-baylibre | gcc-10 | defconfig | 1 Details:
https://kernelci.org/test/plan/id/6417b32604d64d1b3b8c863f
Results: 0 PASS, 1 FAIL, 0 SKIP Full config: defconfig Compiler: gcc-10 (aarch64-linux-gnu-gcc (Debian 10.2.1-6) 10.2.1 20210110) Plain log:
https://storage.kernelci.org//stable-rc/queue-4.14/v4.14.310-24-g818792480c…
HTML log:
https://storage.kernelci.org//stable-rc/queue-4.14/v4.14.310-24-g818792480c…
Rootfs:
http://storage.kernelci.org/images/rootfs/buildroot/buildroot-baseline/2023…
* baseline.login:
https://kernelci.org/test/case/id/6417b32604d64d1b3b8c8640
failing since 237 days (last pass: v4.14.267-41-g23609abc0d54, first fail: v4.14.289-19-g8ed326806c84) platform | arch | lab | compiler | defconfig | regressions ---------------------------+--------+---------------+----------+------------------------------+------------ qemu_arm64-virt-gicv2-uefi | arm64 | lab-broonie | gcc-10 | defconfig+arm64-chromebook | 1 Details:
https://kernelci.org/test/plan/id/6417b40192e5caa5ac8c8659
Results: 0 PASS, 1 FAIL, 0 SKIP Full config: defconfig+arm64-chromebook Compiler: gcc-10 (aarch64-linux-gnu-gcc (Debian 10.2.1-6) 10.2.1 20210110) Plain log:
https://storage.kernelci.org//stable-rc/queue-4.14/v4.14.310-24-g818792480c…
HTML log:
https://storage.kernelci.org//stable-rc/queue-4.14/v4.14.310-24-g818792480c…
Rootfs:
http://storage.kernelci.org/images/rootfs/buildroot/buildroot-baseline/2023…
* baseline.login:
https://kernelci.org/test/case/id/6417b40192e5caa5ac8c865a
failing since 313 days (last pass: v4.14.277-54-gf277f09f64f4, first fail: v4.14.277-75-g7a298ff98d4a) platform | arch | lab | compiler | defconfig | regressions ---------------------------+--------+---------------+----------+------------------------------+------------ qemu_arm64-virt-gicv2-uefi | arm64 | lab-broonie | gcc-10 | defconfig | 1 Details:
https://kernelci.org/test/plan/id/6417b518435cb6b4d28c8657
Results: 0 PASS, 1 FAIL, 0 SKIP Full config: defconfig Compiler: gcc-10 (aarch64-linux-gnu-gcc (Debian 10.2.1-6) 10.2.1 20210110) Plain log:
https://storage.kernelci.org//stable-rc/queue-4.14/v4.14.310-24-g818792480c…
HTML log:
https://storage.kernelci.org//stable-rc/queue-4.14/v4.14.310-24-g818792480c…
Rootfs:
http://storage.kernelci.org/images/rootfs/buildroot/buildroot-baseline/2023…
* baseline.login:
https://kernelci.org/test/case/id/6417b518435cb6b4d28c8658
failing since 237 days (last pass: v4.14.267-41-g23609abc0d54, first fail: v4.14.289-19-g8ed326806c84) platform | arch | lab | compiler | defconfig | regressions ---------------------------+--------+---------------+----------+------------------------------+------------ qemu_arm64-virt-gicv2-uefi | arm64 | lab-collabora | gcc-10 | defconfig | 1 Details:
https://kernelci.org/test/plan/id/6417b2eaff936042068c8672
Results: 0 PASS, 1 FAIL, 0 SKIP Full config: defconfig Compiler: gcc-10 (aarch64-linux-gnu-gcc (Debian 10.2.1-6) 10.2.1 20210110) Plain log:
https://storage.kernelci.org//stable-rc/queue-4.14/v4.14.310-24-g818792480c…
HTML log:
https://storage.kernelci.org//stable-rc/queue-4.14/v4.14.310-24-g818792480c…
Rootfs:
http://storage.kernelci.org/images/rootfs/buildroot/buildroot-baseline/2023…
* baseline.login:
https://kernelci.org/test/case/id/6417b2eaff936042068c8673
failing since 237 days (last pass: v4.14.267-41-g23609abc0d54, first fail: v4.14.289-19-g8ed326806c84) platform | arch | lab | compiler | defconfig | regressions ---------------------------+--------+---------------+----------+------------------------------+------------ qemu_arm64-virt-gicv3 | arm64 | lab-baylibre | gcc-10 | defconfig+arm64-chromebook | 1 Details:
https://kernelci.org/test/plan/id/6417b3119a42d9591f8c8670
Results: 0 PASS, 1 FAIL, 0 SKIP Full config: defconfig+arm64-chromebook Compiler: gcc-10 (aarch64-linux-gnu-gcc (Debian 10.2.1-6) 10.2.1 20210110) Plain log:
https://storage.kernelci.org//stable-rc/queue-4.14/v4.14.310-24-g818792480c…
HTML log:
https://storage.kernelci.org//stable-rc/queue-4.14/v4.14.310-24-g818792480c…
Rootfs:
http://storage.kernelci.org/images/rootfs/buildroot/buildroot-baseline/2023…
* baseline.login:
https://kernelci.org/test/case/id/6417b3119a42d9591f8c8671
failing since 313 days (last pass: v4.14.277-54-gf277f09f64f4, first fail: v4.14.277-75-g7a298ff98d4a) platform | arch | lab | compiler | defconfig | regressions ---------------------------+--------+---------------+----------+------------------------------+------------ qemu_arm64-virt-gicv3 | arm64 | lab-baylibre | gcc-10 | defconfig | 1 Details:
https://kernelci.org/test/plan/id/6417b325628f4d4c148c8635
Results: 0 PASS, 1 FAIL, 0 SKIP Full config: defconfig Compiler: gcc-10 (aarch64-linux-gnu-gcc (Debian 10.2.1-6) 10.2.1 20210110) Plain log:
https://storage.kernelci.org//stable-rc/queue-4.14/v4.14.310-24-g818792480c…
HTML log:
https://storage.kernelci.org//stable-rc/queue-4.14/v4.14.310-24-g818792480c…
Rootfs:
http://storage.kernelci.org/images/rootfs/buildroot/buildroot-baseline/2023…
* baseline.login:
https://kernelci.org/test/case/id/6417b325628f4d4c148c8636
failing since 313 days (last pass: v4.14.277-54-gfa6de16ffc4e, first fail: v4.14.277-75-g7a298ff98d4a) platform | arch | lab | compiler | defconfig | regressions ---------------------------+--------+---------------+----------+------------------------------+------------ qemu_arm64-virt-gicv3 | arm64 | lab-broonie | gcc-10 | defconfig+arm64-chromebook | 1 Details:
https://kernelci.org/test/plan/id/6417b3d79ab40470b08c86ad
Results: 0 PASS, 1 FAIL, 0 SKIP Full config: defconfig+arm64-chromebook Compiler: gcc-10 (aarch64-linux-gnu-gcc (Debian 10.2.1-6) 10.2.1 20210110) Plain log:
https://storage.kernelci.org//stable-rc/queue-4.14/v4.14.310-24-g818792480c…
HTML log:
https://storage.kernelci.org//stable-rc/queue-4.14/v4.14.310-24-g818792480c…
Rootfs:
http://storage.kernelci.org/images/rootfs/buildroot/buildroot-baseline/2023…
* baseline.login:
https://kernelci.org/test/case/id/6417b3d79ab40470b08c86ae
failing since 313 days (last pass: v4.14.277-54-gf277f09f64f4, first fail: v4.14.277-75-g7a298ff98d4a) platform | arch | lab | compiler | defconfig | regressions ---------------------------+--------+---------------+----------+------------------------------+------------ qemu_arm64-virt-gicv3 | arm64 | lab-broonie | gcc-10 | defconfig | 1 Details:
https://kernelci.org/test/plan/id/6417b48cad9da0d0c58c864d
Results: 0 PASS, 1 FAIL, 0 SKIP Full config: defconfig Compiler: gcc-10 (aarch64-linux-gnu-gcc (Debian 10.2.1-6) 10.2.1 20210110) Plain log:
https://storage.kernelci.org//stable-rc/queue-4.14/v4.14.310-24-g818792480c…
HTML log:
https://storage.kernelci.org//stable-rc/queue-4.14/v4.14.310-24-g818792480c…
Rootfs:
http://storage.kernelci.org/images/rootfs/buildroot/buildroot-baseline/2023…
* baseline.login:
https://kernelci.org/test/case/id/6417b48cad9da0d0c58c864e
failing since 313 days (last pass: v4.14.277-54-gfa6de16ffc4e, first fail: v4.14.277-75-g7a298ff98d4a) platform | arch | lab | compiler | defconfig | regressions ---------------------------+--------+---------------+----------+------------------------------+------------ qemu_arm64-virt-gicv3-uefi | arm64 | lab-baylibre | gcc-10 | defconfig+arm64-chromebook | 1 Details:
https://kernelci.org/test/plan/id/6417b2e9ff936042068c866f
Results: 0 PASS, 1 FAIL, 0 SKIP Full config: defconfig+arm64-chromebook Compiler: gcc-10 (aarch64-linux-gnu-gcc (Debian 10.2.1-6) 10.2.1 20210110) Plain log:
https://storage.kernelci.org//stable-rc/queue-4.14/v4.14.310-24-g818792480c…
HTML log:
https://storage.kernelci.org//stable-rc/queue-4.14/v4.14.310-24-g818792480c…
Rootfs:
http://storage.kernelci.org/images/rootfs/buildroot/buildroot-baseline/2023…
* baseline.login:
https://kernelci.org/test/case/id/6417b2e9ff936042068c8670
failing since 237 days (last pass: v4.14.267-41-g23609abc0d54, first fail: v4.14.289-19-g8ed326806c84) platform | arch | lab | compiler | defconfig | regressions ---------------------------+--------+---------------+----------+------------------------------+------------ qemu_arm64-virt-gicv3-uefi | arm64 | lab-baylibre | gcc-10 | defconfig | 1 Details:
https://kernelci.org/test/plan/id/6417b327dd434a2a318c86a1
Results: 0 PASS, 1 FAIL, 0 SKIP Full config: defconfig Compiler: gcc-10 (aarch64-linux-gnu-gcc (Debian 10.2.1-6) 10.2.1 20210110) Plain log:
https://storage.kernelci.org//stable-rc/queue-4.14/v4.14.310-24-g818792480c…
HTML log:
https://storage.kernelci.org//stable-rc/queue-4.14/v4.14.310-24-g818792480c…
Rootfs:
http://storage.kernelci.org/images/rootfs/buildroot/buildroot-baseline/2023…
* baseline.login:
https://kernelci.org/test/case/id/6417b327dd434a2a318c86a2
failing since 313 days (last pass: v4.14.277-54-gfa6de16ffc4e, first fail: v4.14.277-75-g7a298ff98d4a) platform | arch | lab | compiler | defconfig | regressions ---------------------------+--------+---------------+----------+------------------------------+------------ qemu_arm64-virt-gicv3-uefi | arm64 | lab-broonie | gcc-10 | defconfig+arm64-chromebook | 1 Details:
https://kernelci.org/test/plan/id/6417b3d8b370f1f9cf8c862f
Results: 0 PASS, 1 FAIL, 0 SKIP Full config: defconfig+arm64-chromebook Compiler: gcc-10 (aarch64-linux-gnu-gcc (Debian 10.2.1-6) 10.2.1 20210110) Plain log:
https://storage.kernelci.org//stable-rc/queue-4.14/v4.14.310-24-g818792480c…
HTML log:
https://storage.kernelci.org//stable-rc/queue-4.14/v4.14.310-24-g818792480c…
Rootfs:
http://storage.kernelci.org/images/rootfs/buildroot/buildroot-baseline/2023…
* baseline.login:
https://kernelci.org/test/case/id/6417b3d8b370f1f9cf8c8630
failing since 237 days (last pass: v4.14.267-41-g23609abc0d54, first fail: v4.14.289-19-g8ed326806c84) platform | arch | lab | compiler | defconfig | regressions ---------------------------+--------+---------------+----------+------------------------------+------------ qemu_arm64-virt-gicv3-uefi | arm64 | lab-broonie | gcc-10 | defconfig | 1 Details:
https://kernelci.org/test/plan/id/6417b540968e25741d8c8646
Results: 0 PASS, 1 FAIL, 0 SKIP Full config: defconfig Compiler: gcc-10 (aarch64-linux-gnu-gcc (Debian 10.2.1-6) 10.2.1 20210110) Plain log:
https://storage.kernelci.org//stable-rc/queue-4.14/v4.14.310-24-g818792480c…
HTML log:
https://storage.kernelci.org//stable-rc/queue-4.14/v4.14.310-24-g818792480c…
Rootfs:
http://storage.kernelci.org/images/rootfs/buildroot/buildroot-baseline/2023…
* baseline.login:
https://kernelci.org/test/case/id/6417b540968e25741d8c8647
failing since 313 days (last pass: v4.14.277-54-gfa6de16ffc4e, first fail: v4.14.277-75-g7a298ff98d4a) platform | arch | lab | compiler | defconfig | regressions ---------------------------+--------+---------------+----------+------------------------------+------------ qemu_arm64-virt-gicv3-uefi | arm64 | lab-collabora | gcc-10 | defconfig+arm64-chromebook | 1 Details:
https://kernelci.org/test/plan/id/6417b2c2268a67b4198c8661
Results: 0 PASS, 1 FAIL, 0 SKIP Full config: defconfig+arm64-chromebook Compiler: gcc-10 (aarch64-linux-gnu-gcc (Debian 10.2.1-6) 10.2.1 20210110) Plain log:
https://storage.kernelci.org//stable-rc/queue-4.14/v4.14.310-24-g818792480c…
HTML log:
https://storage.kernelci.org//stable-rc/queue-4.14/v4.14.310-24-g818792480c…
Rootfs:
http://storage.kernelci.org/images/rootfs/buildroot/buildroot-baseline/2023…
* baseline.login:
https://kernelci.org/test/case/id/6417b2c2268a67b4198c8662
failing since 237 days (last pass: v4.14.267-41-g23609abc0d54, first fail: v4.14.289-19-g8ed326806c84)
1 year, 11 months
1
0
0
0
stable-rc/queue/5.15 baseline: 170 runs, 1 regressions (v5.15.103-72-ga6fd6a418659)
by kernelci.org bot
stable-rc/queue/5.15 baseline: 170 runs, 1 regressions (v5.15.103-72-ga6fd6a418659) Regressions Summary ------------------- platform | arch | lab | compiler | defconfig | regressions -----------+------+--------------+----------+--------------------+------------ cubietruck | arm | lab-baylibre | gcc-10 | multi_v7_defconfig | 1 Details:
https://kernelci.org/test/job/stable-rc/branch/queue%2F5.15/kernel/v5.15.10…
Test: baseline Tree: stable-rc Branch: queue/5.15 Describe: v5.15.103-72-ga6fd6a418659 URL:
https://git.kernel.org/pub/scm/linux/kernel/git/stable/linux-stable-rc.git
SHA: a6fd6a41865928f824c6c70cc89d3d5d858e6795 Test Regressions ---------------- platform | arch | lab | compiler | defconfig | regressions -----------+------+--------------+----------+--------------------+------------ cubietruck | arm | lab-baylibre | gcc-10 | multi_v7_defconfig | 1 Details:
https://kernelci.org/test/plan/id/6417ad37ef351345fc8c875a
Results: 5 PASS, 1 FAIL, 1 SKIP Full config: multi_v7_defconfig Compiler: gcc-10 (arm-linux-gnueabihf-gcc (Debian 10.2.1-6) 10.2.1 20210110) Plain log:
https://storage.kernelci.org//stable-rc/queue-5.15/v5.15.103-72-ga6fd6a4186…
HTML log:
https://storage.kernelci.org//stable-rc/queue-5.15/v5.15.103-72-ga6fd6a4186…
Rootfs:
http://storage.kernelci.org/images/rootfs/buildroot/buildroot-baseline/2023…
* baseline.bootrr.deferred-probe-empty:
https://kernelci.org/test/case/id/6417ad37ef351345fc8c8763
failing since 61 days (last pass: v5.15.82-123-gd03dbdba21ef, first fail: v5.15.87-100-ge215d5ead661) 2023-03-20T00:47:40.052602 <8>[ 10.044572] <LAVA_SIGNAL_ENDRUN 0_dmesg 3426880_1.5.2.4.1> 2023-03-20T00:47:40.159239 / # # 2023-03-20T00:47:40.260635 export SHELL=/bin/sh 2023-03-20T00:47:40.261010 # 2023-03-20T00:47:40.362162 / # export SHELL=/bin/sh. /lava-3426880/environment 2023-03-20T00:47:40.362531 2023-03-20T00:47:40.463782 / # . /lava-3426880/environment/lava-3426880/bin/lava-test-runner /lava-3426880/1 2023-03-20T00:47:40.464344 2023-03-20T00:47:40.469500 / # /lava-3426880/bin/lava-test-runner /lava-3426880/1 2023-03-20T00:47:40.559589 + export 'TESTRUN_ID=1_bootrr' ... (11 line(s) more)
1 year, 11 months
1
0
0
0
stable-rc/queue/5.4 baseline: 162 runs, 28 regressions (v5.4.237-43-g6da7388788d28)
by kernelci.org bot
stable-rc/queue/5.4 baseline: 162 runs, 28 regressions (v5.4.237-43-g6da7388788d28) Regressions Summary ------------------- platform | arch | lab | compiler | defconfig | regressions -----------------------------+--------+---------------+----------+------------------------------+------------ asus-C433TA-AJ0005-rammus | x86_64 | lab-collabora | gcc-10 | x86_64_defcon...6-chromebook | 1 asus-C436FA-Flip-hatch | x86_64 | lab-collabora | gcc-10 | x86_64_defcon...6-chromebook | 1 cubietruck | arm | lab-baylibre | gcc-10 | multi_v7_defconfig | 1 dell-latitude...4305U-sarien | x86_64 | lab-collabora | gcc-10 | x86_64_defcon...6-chromebook | 1 dell-latitude...8665U-sarien | x86_64 | lab-collabora | gcc-10 | x86_64_defcon...6-chromebook | 1 hifive-unleashed-a00 | riscv | lab-baylibre | gcc-10 | defconfig | 1 hp-x360-14-G1-sona | x86_64 | lab-collabora | gcc-10 | x86_64_defcon...6-chromebook | 1 qemu_arm64-virt-gicv2 | arm64 | lab-baylibre | gcc-10 | defconfig | 1 qemu_arm64-virt-gicv2 | arm64 | lab-baylibre | gcc-10 | defconfig+arm64-chromebook | 1 qemu_arm64-virt-gicv2 | arm64 | lab-broonie | gcc-10 | defconfig | 1 qemu_arm64-virt-gicv2 | arm64 | lab-broonie | gcc-10 | defconfig+arm64-chromebook | 1 qemu_arm64-virt-gicv2 | arm64 | lab-collabora | gcc-10 | defconfig | 1 qemu_arm64-virt-gicv2-uefi | arm64 | lab-baylibre | gcc-10 | defconfig | 1 qemu_arm64-virt-gicv2-uefi | arm64 | lab-baylibre | gcc-10 | defconfig+arm64-chromebook | 1 qemu_arm64-virt-gicv2-uefi | arm64 | lab-broonie | gcc-10 | defconfig | 1 qemu_arm64-virt-gicv2-uefi | arm64 | lab-broonie | gcc-10 | defconfig+arm64-chromebook | 1 qemu_arm64-virt-gicv2-uefi | arm64 | lab-collabora | gcc-10 | defconfig | 1 qemu_arm64-virt-gicv2-uefi | arm64 | lab-collabora | gcc-10 | defconfig+arm64-chromebook | 1 qemu_arm64-virt-gicv3 | arm64 | lab-baylibre | gcc-10 | defconfig | 1 qemu_arm64-virt-gicv3 | arm64 | lab-baylibre | gcc-10 | defconfig+arm64-chromebook | 1 qemu_arm64-virt-gicv3 | arm64 | lab-broonie | gcc-10 | defconfig | 1 qemu_arm64-virt-gicv3 | arm64 | lab-broonie | gcc-10 | defconfig+arm64-chromebook | 1 qemu_arm64-virt-gicv3 | arm64 | lab-collabora | gcc-10 | defconfig+arm64-chromebook | 1 qemu_arm64-virt-gicv3-uefi | arm64 | lab-baylibre | gcc-10 | defconfig | 1 qemu_arm64-virt-gicv3-uefi | arm64 | lab-baylibre | gcc-10 | defconfig+arm64-chromebook | 1 qemu_arm64-virt-gicv3-uefi | arm64 | lab-broonie | gcc-10 | defconfig | 1 qemu_arm64-virt-gicv3-uefi | arm64 | lab-broonie | gcc-10 | defconfig+arm64-chromebook | 1 sun8i-h3-libretech-all-h3-cc | arm | lab-baylibre | gcc-10 | multi_v7_defconfig | 1 Details:
https://kernelci.org/test/job/stable-rc/branch/queue%2F5.4/kernel/v5.4.237-…
Test: baseline Tree: stable-rc Branch: queue/5.4 Describe: v5.4.237-43-g6da7388788d28 URL:
https://git.kernel.org/pub/scm/linux/kernel/git/stable/linux-stable-rc.git
SHA: 6da7388788d282ce80c6cc93e7c9753f8050ac22 Test Regressions ---------------- platform | arch | lab | compiler | defconfig | regressions -----------------------------+--------+---------------+----------+------------------------------+------------ asus-C433TA-AJ0005-rammus | x86_64 | lab-collabora | gcc-10 | x86_64_defcon...6-chromebook | 1 Details:
https://kernelci.org/test/plan/id/6417ad4daeef37c4968c864c
Results: 0 PASS, 1 FAIL, 0 SKIP Full config: x86_64_defconfig+x86-chromebook Compiler: gcc-10 (gcc (Debian 10.2.1-6) 10.2.1 20210110) Plain log:
https://storage.kernelci.org//stable-rc/queue-5.4/v5.4.237-43-g6da7388788d2…
HTML log:
https://storage.kernelci.org//stable-rc/queue-5.4/v5.4.237-43-g6da7388788d2…
Rootfs:
http://storage.kernelci.org/images/rootfs/buildroot/buildroot-baseline/2023…
* baseline.login:
https://kernelci.org/test/case/id/6417ad4daeef37c4968c864d
failing since 3 days (last pass: v5.4.235-28-gdf26328822db, first fail: v5.4.235-58-g6a07aa5be5066) platform | arch | lab | compiler | defconfig | regressions -----------------------------+--------+---------------+----------+------------------------------+------------ asus-C436FA-Flip-hatch | x86_64 | lab-collabora | gcc-10 | x86_64_defcon...6-chromebook | 1 Details:
https://kernelci.org/test/plan/id/6417ad4eaeef37c4968c864f
Results: 0 PASS, 1 FAIL, 0 SKIP Full config: x86_64_defconfig+x86-chromebook Compiler: gcc-10 (gcc (Debian 10.2.1-6) 10.2.1 20210110) Plain log:
https://storage.kernelci.org//stable-rc/queue-5.4/v5.4.237-43-g6da7388788d2…
HTML log:
https://storage.kernelci.org//stable-rc/queue-5.4/v5.4.237-43-g6da7388788d2…
Rootfs:
http://storage.kernelci.org/images/rootfs/buildroot/buildroot-baseline/2023…
* baseline.login:
https://kernelci.org/test/case/id/6417ad4eaeef37c4968c8650
failing since 4 days (last pass: v5.4.235-72-g88ec32cc64988, first fail: v5.4.235-82-gb662e86fe8a7c) platform | arch | lab | compiler | defconfig | regressions -----------------------------+--------+---------------+----------+------------------------------+------------ cubietruck | arm | lab-baylibre | gcc-10 | multi_v7_defconfig | 1 Details:
https://kernelci.org/test/plan/id/6417af34f653f86f738c8640
Results: 5 PASS, 1 FAIL, 1 SKIP Full config: multi_v7_defconfig Compiler: gcc-10 (arm-linux-gnueabihf-gcc (Debian 10.2.1-6) 10.2.1 20210110) Plain log:
https://storage.kernelci.org//stable-rc/queue-5.4/v5.4.237-43-g6da7388788d2…
HTML log:
https://storage.kernelci.org//stable-rc/queue-5.4/v5.4.237-43-g6da7388788d2…
Rootfs:
http://storage.kernelci.org/images/rootfs/buildroot/buildroot-baseline/2023…
* baseline.bootrr.deferred-probe-empty:
https://kernelci.org/test/case/id/6417af34f653f86f738c8649
failing since 48 days (last pass: v5.4.230-81-g2ad0dc06d587, first fail: v5.4.230-108-g761a8268d868) 2023-03-20T00:56:08.794667 <8>[ 9.912843] <LAVA_SIGNAL_ENDRUN 0_dmesg 3426946_1.5.2.4.1> 2023-03-20T00:56:08.903819 / # # 2023-03-20T00:56:09.006877 export SHELL=/bin/sh 2023-03-20T00:56:09.007824 # 2023-03-20T00:56:09.109843 / # export SHELL=/bin/sh. /lava-3426946/environment 2023-03-20T00:56:09.110864 2023-03-20T00:56:09.213170 / # . /lava-3426946/environment/lava-3426946/bin/lava-test-runner /lava-3426946/1 2023-03-20T00:56:09.214563 2023-03-20T00:56:09.214962 / # /lava-3426946/bin/lava-test-runner /lava-3426946/1<3>[ 10.320710] Bluetooth: hci0: command 0xfc18 tx timeout 2023-03-20T00:56:09.219532 ... (12 line(s) more) platform | arch | lab | compiler | defconfig | regressions -----------------------------+--------+---------------+----------+------------------------------+------------ dell-latitude...4305U-sarien | x86_64 | lab-collabora | gcc-10 | x86_64_defcon...6-chromebook | 1 Details:
https://kernelci.org/test/plan/id/6417ad4daeef37c4968c8649
Results: 0 PASS, 1 FAIL, 0 SKIP Full config: x86_64_defconfig+x86-chromebook Compiler: gcc-10 (gcc (Debian 10.2.1-6) 10.2.1 20210110) Plain log:
https://storage.kernelci.org//stable-rc/queue-5.4/v5.4.237-43-g6da7388788d2…
HTML log:
https://storage.kernelci.org//stable-rc/queue-5.4/v5.4.237-43-g6da7388788d2…
Rootfs:
http://storage.kernelci.org/images/rootfs/buildroot/buildroot-baseline/2023…
* baseline.login:
https://kernelci.org/test/case/id/6417ad4daeef37c4968c864a
failing since 3 days (last pass: v5.4.235-28-gdf26328822db, first fail: v5.4.235-58-g6a07aa5be5066) platform | arch | lab | compiler | defconfig | regressions -----------------------------+--------+---------------+----------+------------------------------+------------ dell-latitude...8665U-sarien | x86_64 | lab-collabora | gcc-10 | x86_64_defcon...6-chromebook | 1 Details:
https://kernelci.org/test/plan/id/6417af41272886c6368c866d
Results: 0 PASS, 1 FAIL, 0 SKIP Full config: x86_64_defconfig+x86-chromebook Compiler: gcc-10 (gcc (Debian 10.2.1-6) 10.2.1 20210110) Plain log:
https://storage.kernelci.org//stable-rc/queue-5.4/v5.4.237-43-g6da7388788d2…
HTML log:
https://storage.kernelci.org//stable-rc/queue-5.4/v5.4.237-43-g6da7388788d2…
Rootfs:
http://storage.kernelci.org/images/rootfs/buildroot/buildroot-baseline/2023…
* baseline.login:
https://kernelci.org/test/case/id/6417af41272886c6368c866e
failing since 3 days (last pass: v5.4.235-28-gdf26328822db, first fail: v5.4.235-58-g6a07aa5be5066) platform | arch | lab | compiler | defconfig | regressions -----------------------------+--------+---------------+----------+------------------------------+------------ hifive-unleashed-a00 | riscv | lab-baylibre | gcc-10 | defconfig | 1 Details:
https://kernelci.org/test/plan/id/6417aad5a2cf8c259d8c8633
Results: 3 PASS, 2 FAIL, 2 SKIP Full config: defconfig Compiler: gcc-10 (riscv64-linux-gnu-gcc (Debian 10.2.1-6) 10.2.1 20210110) Plain log:
https://storage.kernelci.org//stable-rc/queue-5.4/v5.4.237-43-g6da7388788d2…
HTML log:
https://storage.kernelci.org//stable-rc/queue-5.4/v5.4.237-43-g6da7388788d2…
Rootfs:
http://storage.kernelci.org/images/rootfs/buildroot/buildroot-baseline/2023…
* baseline.dmesg.crit:
https://kernelci.org/test/case/id/6417aad5a2cf8c259d8c8638
failing since 151 days (last pass: v5.4.219-270-gde284a6cd1e4, first fail: v5.4.219-266-g5eb28a6c7901) 3 lines 2023-03-20T00:37:22.720499 / # 2023-03-20T00:37:22.721334 2023-03-20T00:37:24.786218 / # # 2023-03-20T00:37:24.787502 # 2023-03-20T00:37:26.797477 / # export SHELL=/bin/sh 2023-03-20T00:37:26.797936 export SHELL=/bin/sh 2023-03-20T00:37:28.812921 / # . /lava-3426819/environment 2023-03-20T00:37:28.813339 . /lava-3426819/environment 2023-03-20T00:37:30.828549 / # /lava-3426819/bin/lava-test-runner /lava-3426819/0 2023-03-20T00:37:30.830780 /lava-3426819/bin/lava-test-runner /lava-3426819/0 ... (9 line(s) more) platform | arch | lab | compiler | defconfig | regressions -----------------------------+--------+---------------+----------+------------------------------+------------ hp-x360-14-G1-sona | x86_64 | lab-collabora | gcc-10 | x86_64_defcon...6-chromebook | 1 Details:
https://kernelci.org/test/plan/id/6417aede36a767e6078c8635
Results: 0 PASS, 1 FAIL, 0 SKIP Full config: x86_64_defconfig+x86-chromebook Compiler: gcc-10 (gcc (Debian 10.2.1-6) 10.2.1 20210110) Plain log:
https://storage.kernelci.org//stable-rc/queue-5.4/v5.4.237-43-g6da7388788d2…
HTML log:
https://storage.kernelci.org//stable-rc/queue-5.4/v5.4.237-43-g6da7388788d2…
Rootfs:
http://storage.kernelci.org/images/rootfs/buildroot/buildroot-baseline/2023…
* baseline.login:
https://kernelci.org/test/case/id/6417aedf36a767e6078c8636
failing since 2 days (last pass: v5.4.235-28-gdf26328822db, first fail: v5.4.236-54-gb822a3689cd8) platform | arch | lab | compiler | defconfig | regressions -----------------------------+--------+---------------+----------+------------------------------+------------ qemu_arm64-virt-gicv2 | arm64 | lab-baylibre | gcc-10 | defconfig | 1 Details:
https://kernelci.org/test/plan/id/6417af2d272886c6368c865d
Results: 0 PASS, 1 FAIL, 0 SKIP Full config: defconfig Compiler: gcc-10 (aarch64-linux-gnu-gcc (Debian 10.2.1-6) 10.2.1 20210110) Plain log:
https://storage.kernelci.org//stable-rc/queue-5.4/v5.4.237-43-g6da7388788d2…
HTML log:
https://storage.kernelci.org//stable-rc/queue-5.4/v5.4.237-43-g6da7388788d2…
Rootfs:
http://storage.kernelci.org/images/rootfs/buildroot/buildroot-baseline/2023…
* baseline.login:
https://kernelci.org/test/case/id/6417af2d272886c6368c865e
failing since 237 days (last pass: v5.4.180-77-g7de29e82b9db, first fail: v5.4.207-73-ga2480f1b1dda1) platform | arch | lab | compiler | defconfig | regressions -----------------------------+--------+---------------+----------+------------------------------+------------ qemu_arm64-virt-gicv2 | arm64 | lab-baylibre | gcc-10 | defconfig+arm64-chromebook | 1 Details:
https://kernelci.org/test/plan/id/6417afa02917d878788c863c
Results: 0 PASS, 1 FAIL, 0 SKIP Full config: defconfig+arm64-chromebook Compiler: gcc-10 (aarch64-linux-gnu-gcc (Debian 10.2.1-6) 10.2.1 20210110) Plain log:
https://storage.kernelci.org//stable-rc/queue-5.4/v5.4.237-43-g6da7388788d2…
HTML log:
https://storage.kernelci.org//stable-rc/queue-5.4/v5.4.237-43-g6da7388788d2…
Rootfs:
http://storage.kernelci.org/images/rootfs/buildroot/buildroot-baseline/2023…
* baseline.login:
https://kernelci.org/test/case/id/6417afa02917d878788c863d
failing since 313 days (last pass: v5.4.191-84-g56ce42d78d96, first fail: v5.4.191-125-g5917d1547e6e) platform | arch | lab | compiler | defconfig | regressions -----------------------------+--------+---------------+----------+------------------------------+------------ qemu_arm64-virt-gicv2 | arm64 | lab-broonie | gcc-10 | defconfig | 1 Details:
https://kernelci.org/test/plan/id/6417af4e8d1708d3ff8c8687
Results: 0 PASS, 1 FAIL, 0 SKIP Full config: defconfig Compiler: gcc-10 (aarch64-linux-gnu-gcc (Debian 10.2.1-6) 10.2.1 20210110) Plain log:
https://storage.kernelci.org//stable-rc/queue-5.4/v5.4.237-43-g6da7388788d2…
HTML log:
https://storage.kernelci.org//stable-rc/queue-5.4/v5.4.237-43-g6da7388788d2…
Rootfs:
http://storage.kernelci.org/images/rootfs/buildroot/buildroot-baseline/2023…
* baseline.login:
https://kernelci.org/test/case/id/6417af4e8d1708d3ff8c8688
failing since 237 days (last pass: v5.4.180-77-g7de29e82b9db, first fail: v5.4.207-73-ga2480f1b1dda1) platform | arch | lab | compiler | defconfig | regressions -----------------------------+--------+---------------+----------+------------------------------+------------ qemu_arm64-virt-gicv2 | arm64 | lab-broonie | gcc-10 | defconfig+arm64-chromebook | 1 Details:
https://kernelci.org/test/plan/id/6417b1e391efe8f4e98c865b
Results: 0 PASS, 1 FAIL, 0 SKIP Full config: defconfig+arm64-chromebook Compiler: gcc-10 (aarch64-linux-gnu-gcc (Debian 10.2.1-6) 10.2.1 20210110) Plain log:
https://storage.kernelci.org//stable-rc/queue-5.4/v5.4.237-43-g6da7388788d2…
HTML log:
https://storage.kernelci.org//stable-rc/queue-5.4/v5.4.237-43-g6da7388788d2…
Rootfs:
http://storage.kernelci.org/images/rootfs/buildroot/buildroot-baseline/2023…
* baseline.login:
https://kernelci.org/test/case/id/6417b1e391efe8f4e98c865c
failing since 313 days (last pass: v5.4.191-84-g56ce42d78d96, first fail: v5.4.191-125-g5917d1547e6e) platform | arch | lab | compiler | defconfig | regressions -----------------------------+--------+---------------+----------+------------------------------+------------ qemu_arm64-virt-gicv2 | arm64 | lab-collabora | gcc-10 | defconfig | 1 Details:
https://kernelci.org/test/plan/id/6417aeee46a2611c848c9f79
Results: 0 PASS, 1 FAIL, 0 SKIP Full config: defconfig Compiler: gcc-10 (aarch64-linux-gnu-gcc (Debian 10.2.1-6) 10.2.1 20210110) Plain log:
https://storage.kernelci.org//stable-rc/queue-5.4/v5.4.237-43-g6da7388788d2…
HTML log:
https://storage.kernelci.org//stable-rc/queue-5.4/v5.4.237-43-g6da7388788d2…
Rootfs:
http://storage.kernelci.org/images/rootfs/buildroot/buildroot-baseline/2023…
* baseline.login:
https://kernelci.org/test/case/id/6417aeee46a2611c848c9f7a
failing since 237 days (last pass: v5.4.180-77-g7de29e82b9db, first fail: v5.4.207-73-ga2480f1b1dda1) platform | arch | lab | compiler | defconfig | regressions -----------------------------+--------+---------------+----------+------------------------------+------------ qemu_arm64-virt-gicv2-uefi | arm64 | lab-baylibre | gcc-10 | defconfig | 1 Details:
https://kernelci.org/test/plan/id/6417af3cf653f86f738c864c
Results: 0 PASS, 1 FAIL, 0 SKIP Full config: defconfig Compiler: gcc-10 (aarch64-linux-gnu-gcc (Debian 10.2.1-6) 10.2.1 20210110) Plain log:
https://storage.kernelci.org//stable-rc/queue-5.4/v5.4.237-43-g6da7388788d2…
HTML log:
https://storage.kernelci.org//stable-rc/queue-5.4/v5.4.237-43-g6da7388788d2…
Rootfs:
http://storage.kernelci.org/images/rootfs/buildroot/buildroot-baseline/2023…
* baseline.login:
https://kernelci.org/test/case/id/6417af3cf653f86f738c864d
failing since 237 days (last pass: v5.4.180-77-g7de29e82b9db, first fail: v5.4.207-73-ga2480f1b1dda1) platform | arch | lab | compiler | defconfig | regressions -----------------------------+--------+---------------+----------+------------------------------+------------ qemu_arm64-virt-gicv2-uefi | arm64 | lab-baylibre | gcc-10 | defconfig+arm64-chromebook | 1 Details:
https://kernelci.org/test/plan/id/6417aff0669476635a8c8671
Results: 0 PASS, 1 FAIL, 0 SKIP Full config: defconfig+arm64-chromebook Compiler: gcc-10 (aarch64-linux-gnu-gcc (Debian 10.2.1-6) 10.2.1 20210110) Plain log:
https://storage.kernelci.org//stable-rc/queue-5.4/v5.4.237-43-g6da7388788d2…
HTML log:
https://storage.kernelci.org//stable-rc/queue-5.4/v5.4.237-43-g6da7388788d2…
Rootfs:
http://storage.kernelci.org/images/rootfs/buildroot/buildroot-baseline/2023…
* baseline.login:
https://kernelci.org/test/case/id/6417aff0669476635a8c8672
failing since 237 days (last pass: v5.4.180-77-g7de29e82b9db, first fail: v5.4.207-73-ga2480f1b1dda1) platform | arch | lab | compiler | defconfig | regressions -----------------------------+--------+---------------+----------+------------------------------+------------ qemu_arm64-virt-gicv2-uefi | arm64 | lab-broonie | gcc-10 | defconfig | 1 Details:
https://kernelci.org/test/plan/id/6417b02b852c153a598c8644
Results: 0 PASS, 1 FAIL, 0 SKIP Full config: defconfig Compiler: gcc-10 (aarch64-linux-gnu-gcc (Debian 10.2.1-6) 10.2.1 20210110) Plain log:
https://storage.kernelci.org//stable-rc/queue-5.4/v5.4.237-43-g6da7388788d2…
HTML log:
https://storage.kernelci.org//stable-rc/queue-5.4/v5.4.237-43-g6da7388788d2…
Rootfs:
http://storage.kernelci.org/images/rootfs/buildroot/buildroot-baseline/2023…
* baseline.login:
https://kernelci.org/test/case/id/6417b02b852c153a598c8645
failing since 237 days (last pass: v5.4.180-77-g7de29e82b9db, first fail: v5.4.207-73-ga2480f1b1dda1) platform | arch | lab | compiler | defconfig | regressions -----------------------------+--------+---------------+----------+------------------------------+------------ qemu_arm64-virt-gicv2-uefi | arm64 | lab-broonie | gcc-10 | defconfig+arm64-chromebook | 1 Details:
https://kernelci.org/test/plan/id/6417b1e43982ec33108c86ea
Results: 0 PASS, 1 FAIL, 0 SKIP Full config: defconfig+arm64-chromebook Compiler: gcc-10 (aarch64-linux-gnu-gcc (Debian 10.2.1-6) 10.2.1 20210110) Plain log:
https://storage.kernelci.org//stable-rc/queue-5.4/v5.4.237-43-g6da7388788d2…
HTML log:
https://storage.kernelci.org//stable-rc/queue-5.4/v5.4.237-43-g6da7388788d2…
Rootfs:
http://storage.kernelci.org/images/rootfs/buildroot/buildroot-baseline/2023…
* baseline.login:
https://kernelci.org/test/case/id/6417b1e43982ec33108c86eb
failing since 237 days (last pass: v5.4.180-77-g7de29e82b9db, first fail: v5.4.207-73-ga2480f1b1dda1) platform | arch | lab | compiler | defconfig | regressions -----------------------------+--------+---------------+----------+------------------------------+------------ qemu_arm64-virt-gicv2-uefi | arm64 | lab-collabora | gcc-10 | defconfig | 1 Details:
https://kernelci.org/test/plan/id/6417aeef46a2611c848c9f80
Results: 0 PASS, 1 FAIL, 0 SKIP Full config: defconfig Compiler: gcc-10 (aarch64-linux-gnu-gcc (Debian 10.2.1-6) 10.2.1 20210110) Plain log:
https://storage.kernelci.org//stable-rc/queue-5.4/v5.4.237-43-g6da7388788d2…
HTML log:
https://storage.kernelci.org//stable-rc/queue-5.4/v5.4.237-43-g6da7388788d2…
Rootfs:
http://storage.kernelci.org/images/rootfs/buildroot/buildroot-baseline/2023…
* baseline.login:
https://kernelci.org/test/case/id/6417aeef46a2611c848c9f81
failing since 237 days (last pass: v5.4.180-77-g7de29e82b9db, first fail: v5.4.207-73-ga2480f1b1dda1) platform | arch | lab | compiler | defconfig | regressions -----------------------------+--------+---------------+----------+------------------------------+------------ qemu_arm64-virt-gicv2-uefi | arm64 | lab-collabora | gcc-10 | defconfig+arm64-chromebook | 1 Details:
https://kernelci.org/test/plan/id/6417af8e9c7b592c878c8676
Results: 0 PASS, 1 FAIL, 0 SKIP Full config: defconfig+arm64-chromebook Compiler: gcc-10 (aarch64-linux-gnu-gcc (Debian 10.2.1-6) 10.2.1 20210110) Plain log:
https://storage.kernelci.org//stable-rc/queue-5.4/v5.4.237-43-g6da7388788d2…
HTML log:
https://storage.kernelci.org//stable-rc/queue-5.4/v5.4.237-43-g6da7388788d2…
Rootfs:
http://storage.kernelci.org/images/rootfs/buildroot/buildroot-baseline/2023…
* baseline.login:
https://kernelci.org/test/case/id/6417af8e9c7b592c878c8677
failing since 237 days (last pass: v5.4.180-77-g7de29e82b9db, first fail: v5.4.207-73-ga2480f1b1dda1) platform | arch | lab | compiler | defconfig | regressions -----------------------------+--------+---------------+----------+------------------------------+------------ qemu_arm64-virt-gicv3 | arm64 | lab-baylibre | gcc-10 | defconfig | 1 Details:
https://kernelci.org/test/plan/id/6417af3ded225834b48c8771
Results: 0 PASS, 1 FAIL, 0 SKIP Full config: defconfig Compiler: gcc-10 (aarch64-linux-gnu-gcc (Debian 10.2.1-6) 10.2.1 20210110) Plain log:
https://storage.kernelci.org//stable-rc/queue-5.4/v5.4.237-43-g6da7388788d2…
HTML log:
https://storage.kernelci.org//stable-rc/queue-5.4/v5.4.237-43-g6da7388788d2…
Rootfs:
http://storage.kernelci.org/images/rootfs/buildroot/buildroot-baseline/2023…
* baseline.login:
https://kernelci.org/test/case/id/6417af3ded225834b48c8772
failing since 313 days (last pass: v5.4.191-77-g1a3b249e415b, first fail: v5.4.191-125-g5917d1547e6e) platform | arch | lab | compiler | defconfig | regressions -----------------------------+--------+---------------+----------+------------------------------+------------ qemu_arm64-virt-gicv3 | arm64 | lab-baylibre | gcc-10 | defconfig+arm64-chromebook | 1 Details:
https://kernelci.org/test/plan/id/6417b004616bab33bb8c863a
Results: 0 PASS, 1 FAIL, 0 SKIP Full config: defconfig+arm64-chromebook Compiler: gcc-10 (aarch64-linux-gnu-gcc (Debian 10.2.1-6) 10.2.1 20210110) Plain log:
https://storage.kernelci.org//stable-rc/queue-5.4/v5.4.237-43-g6da7388788d2…
HTML log:
https://storage.kernelci.org//stable-rc/queue-5.4/v5.4.237-43-g6da7388788d2…
Rootfs:
http://storage.kernelci.org/images/rootfs/buildroot/buildroot-baseline/2023…
* baseline.login:
https://kernelci.org/test/case/id/6417b004616bab33bb8c863b
failing since 237 days (last pass: v5.4.180-77-g7de29e82b9db, first fail: v5.4.207-73-ga2480f1b1dda1) platform | arch | lab | compiler | defconfig | regressions -----------------------------+--------+---------------+----------+------------------------------+------------ qemu_arm64-virt-gicv3 | arm64 | lab-broonie | gcc-10 | defconfig | 1 Details:
https://kernelci.org/test/plan/id/6417b0b7f9d4535c2c8c863e
Results: 0 PASS, 1 FAIL, 0 SKIP Full config: defconfig Compiler: gcc-10 (aarch64-linux-gnu-gcc (Debian 10.2.1-6) 10.2.1 20210110) Plain log:
https://storage.kernelci.org//stable-rc/queue-5.4/v5.4.237-43-g6da7388788d2…
HTML log:
https://storage.kernelci.org//stable-rc/queue-5.4/v5.4.237-43-g6da7388788d2…
Rootfs:
http://storage.kernelci.org/images/rootfs/buildroot/buildroot-baseline/2023…
* baseline.login:
https://kernelci.org/test/case/id/6417b0b7f9d4535c2c8c863f
failing since 313 days (last pass: v5.4.191-77-g1a3b249e415b, first fail: v5.4.191-125-g5917d1547e6e) platform | arch | lab | compiler | defconfig | regressions -----------------------------+--------+---------------+----------+------------------------------+------------ qemu_arm64-virt-gicv3 | arm64 | lab-broonie | gcc-10 | defconfig+arm64-chromebook | 1 Details:
https://kernelci.org/test/plan/id/6417b21f46d5cf63698c8633
Results: 0 PASS, 1 FAIL, 0 SKIP Full config: defconfig+arm64-chromebook Compiler: gcc-10 (aarch64-linux-gnu-gcc (Debian 10.2.1-6) 10.2.1 20210110) Plain log:
https://storage.kernelci.org//stable-rc/queue-5.4/v5.4.237-43-g6da7388788d2…
HTML log:
https://storage.kernelci.org//stable-rc/queue-5.4/v5.4.237-43-g6da7388788d2…
Rootfs:
http://storage.kernelci.org/images/rootfs/buildroot/buildroot-baseline/2023…
* baseline.login:
https://kernelci.org/test/case/id/6417b21f46d5cf63698c8634
failing since 237 days (last pass: v5.4.180-77-g7de29e82b9db, first fail: v5.4.207-73-ga2480f1b1dda1) platform | arch | lab | compiler | defconfig | regressions -----------------------------+--------+---------------+----------+------------------------------+------------ qemu_arm64-virt-gicv3 | arm64 | lab-collabora | gcc-10 | defconfig+arm64-chromebook | 1 Details:
https://kernelci.org/test/plan/id/6417af8f2917d878788c8634
Results: 0 PASS, 1 FAIL, 0 SKIP Full config: defconfig+arm64-chromebook Compiler: gcc-10 (aarch64-linux-gnu-gcc (Debian 10.2.1-6) 10.2.1 20210110) Plain log:
https://storage.kernelci.org//stable-rc/queue-5.4/v5.4.237-43-g6da7388788d2…
HTML log:
https://storage.kernelci.org//stable-rc/queue-5.4/v5.4.237-43-g6da7388788d2…
Rootfs:
http://storage.kernelci.org/images/rootfs/buildroot/buildroot-baseline/2023…
* baseline.login:
https://kernelci.org/test/case/id/6417af8f2917d878788c8635
failing since 237 days (last pass: v5.4.180-77-g7de29e82b9db, first fail: v5.4.207-73-ga2480f1b1dda1) platform | arch | lab | compiler | defconfig | regressions -----------------------------+--------+---------------+----------+------------------------------+------------ qemu_arm64-virt-gicv3-uefi | arm64 | lab-baylibre | gcc-10 | defconfig | 1 Details:
https://kernelci.org/test/plan/id/6417af2e87128d3b668c8647
Results: 0 PASS, 1 FAIL, 0 SKIP Full config: defconfig Compiler: gcc-10 (aarch64-linux-gnu-gcc (Debian 10.2.1-6) 10.2.1 20210110) Plain log:
https://storage.kernelci.org//stable-rc/queue-5.4/v5.4.237-43-g6da7388788d2…
HTML log:
https://storage.kernelci.org//stable-rc/queue-5.4/v5.4.237-43-g6da7388788d2…
Rootfs:
http://storage.kernelci.org/images/rootfs/buildroot/buildroot-baseline/2023…
* baseline.login:
https://kernelci.org/test/case/id/6417af2e87128d3b668c8648
failing since 313 days (last pass: v5.4.191-77-g1a3b249e415b, first fail: v5.4.191-125-g5917d1547e6e) platform | arch | lab | compiler | defconfig | regressions -----------------------------+--------+---------------+----------+------------------------------+------------ qemu_arm64-virt-gicv3-uefi | arm64 | lab-baylibre | gcc-10 | defconfig+arm64-chromebook | 1 Details:
https://kernelci.org/test/plan/id/6417b005616bab33bb8c863f
Results: 0 PASS, 1 FAIL, 0 SKIP Full config: defconfig+arm64-chromebook Compiler: gcc-10 (aarch64-linux-gnu-gcc (Debian 10.2.1-6) 10.2.1 20210110) Plain log:
https://storage.kernelci.org//stable-rc/queue-5.4/v5.4.237-43-g6da7388788d2…
HTML log:
https://storage.kernelci.org//stable-rc/queue-5.4/v5.4.237-43-g6da7388788d2…
Rootfs:
http://storage.kernelci.org/images/rootfs/buildroot/buildroot-baseline/2023…
* baseline.login:
https://kernelci.org/test/case/id/6417b005616bab33bb8c8640
failing since 313 days (last pass: v5.4.191-84-g56ce42d78d96, first fail: v5.4.191-125-g5917d1547e6e) platform | arch | lab | compiler | defconfig | regressions -----------------------------+--------+---------------+----------+------------------------------+------------ qemu_arm64-virt-gicv3-uefi | arm64 | lab-broonie | gcc-10 | defconfig | 1 Details:
https://kernelci.org/test/plan/id/6417afb219051cbdf48c8694
Results: 0 PASS, 1 FAIL, 0 SKIP Full config: defconfig Compiler: gcc-10 (aarch64-linux-gnu-gcc (Debian 10.2.1-6) 10.2.1 20210110) Plain log:
https://storage.kernelci.org//stable-rc/queue-5.4/v5.4.237-43-g6da7388788d2…
HTML log:
https://storage.kernelci.org//stable-rc/queue-5.4/v5.4.237-43-g6da7388788d2…
Rootfs:
http://storage.kernelci.org/images/rootfs/buildroot/buildroot-baseline/2023…
* baseline.login:
https://kernelci.org/test/case/id/6417afb219051cbdf48c8695
failing since 313 days (last pass: v5.4.191-77-g1a3b249e415b, first fail: v5.4.191-125-g5917d1547e6e) platform | arch | lab | compiler | defconfig | regressions -----------------------------+--------+---------------+----------+------------------------------+------------ qemu_arm64-virt-gicv3-uefi | arm64 | lab-broonie | gcc-10 | defconfig+arm64-chromebook | 1 Details:
https://kernelci.org/test/plan/id/6417b2bf09318bc57c8c8640
Results: 0 PASS, 1 FAIL, 0 SKIP Full config: defconfig+arm64-chromebook Compiler: gcc-10 (aarch64-linux-gnu-gcc (Debian 10.2.1-6) 10.2.1 20210110) Plain log:
https://storage.kernelci.org//stable-rc/queue-5.4/v5.4.237-43-g6da7388788d2…
HTML log:
https://storage.kernelci.org//stable-rc/queue-5.4/v5.4.237-43-g6da7388788d2…
Rootfs:
http://storage.kernelci.org/images/rootfs/buildroot/buildroot-baseline/2023…
* baseline.login:
https://kernelci.org/test/case/id/6417b2bf09318bc57c8c8641
failing since 313 days (last pass: v5.4.191-84-g56ce42d78d96, first fail: v5.4.191-125-g5917d1547e6e) platform | arch | lab | compiler | defconfig | regressions -----------------------------+--------+---------------+----------+------------------------------+------------ sun8i-h3-libretech-all-h3-cc | arm | lab-baylibre | gcc-10 | multi_v7_defconfig | 1 Details:
https://kernelci.org/test/plan/id/6417ae796b266acba78c8653
Results: 5 PASS, 1 FAIL, 1 SKIP Full config: multi_v7_defconfig Compiler: gcc-10 (arm-linux-gnueabihf-gcc (Debian 10.2.1-6) 10.2.1 20210110) Plain log:
https://storage.kernelci.org//stable-rc/queue-5.4/v5.4.237-43-g6da7388788d2…
HTML log:
https://storage.kernelci.org//stable-rc/queue-5.4/v5.4.237-43-g6da7388788d2…
Rootfs:
http://storage.kernelci.org/images/rootfs/buildroot/buildroot-baseline/2023…
* baseline.bootrr.deferred-probe-empty:
https://kernelci.org/test/case/id/6417ae796b266acba78c865c
failing since 46 days (last pass: v5.4.230-108-g761a8268d868, first fail: v5.4.230-109-g0a6085bff265) 2023-03-20T00:52:45.162584 / # # 2023-03-20T00:52:45.265032 export SHELL=/bin/sh 2023-03-20T00:52:45.265709 # 2023-03-20T00:52:45.367288 / # export SHELL=/bin/sh. /lava-3426947/environment 2023-03-20T00:52:45.367907 2023-03-20T00:52:45.469553 / # . /lava-3426947/environment/lava-3426947/bin/lava-test-runner /lava-3426947/1 2023-03-20T00:52:45.470554 2023-03-20T00:52:45.486687 / # /lava-3426947/bin/lava-test-runner /lava-3426947/1 2023-03-20T00:52:45.562721 + export 'TESTRUN_ID=1_bootrr' 2023-03-20T00:52:45.563528 + cd /lava-3426947/1/tests/1_bootrr ... (10 line(s) more)
1 year, 11 months
1
0
0
0
stable-rc/queue/6.1 baseline: 134 runs, 2 regressions (v6.1.20-115-g3429cbf2d9cb)
by kernelci.org bot
stable-rc/queue/6.1 baseline: 134 runs, 2 regressions (v6.1.20-115-g3429cbf2d9cb) Regressions Summary ------------------- platform | arch | lab | compiler | defconfig | regressions -------------------+------+---------------+----------+-------------------+------------ bcm2835-rpi-b-rev2 | arm | lab-broonie | gcc-10 | bcm2835_defconfig | 1 tegra124-nyan-big | arm | lab-collabora | gcc-10 | tegra_defconfig | 1 Details:
https://kernelci.org/test/job/stable-rc/branch/queue%2F6.1/kernel/v6.1.20-1…
Test: baseline Tree: stable-rc Branch: queue/6.1 Describe: v6.1.20-115-g3429cbf2d9cb URL:
https://git.kernel.org/pub/scm/linux/kernel/git/stable/linux-stable-rc.git
SHA: 3429cbf2d9cb9f4bd6187d0640f0716b60a78603 Test Regressions ---------------- platform | arch | lab | compiler | defconfig | regressions -------------------+------+---------------+----------+-------------------+------------ bcm2835-rpi-b-rev2 | arm | lab-broonie | gcc-10 | bcm2835_defconfig | 1 Details:
https://kernelci.org/test/plan/id/6417a6817b820202e18c8663
Results: 50 PASS, 2 FAIL, 1 SKIP Full config: bcm2835_defconfig Compiler: gcc-10 (arm-linux-gnueabihf-gcc (Debian 10.2.1-6) 10.2.1 20210110) Plain log:
https://storage.kernelci.org//stable-rc/queue-6.1/v6.1.20-115-g3429cbf2d9cb…
HTML log:
https://storage.kernelci.org//stable-rc/queue-6.1/v6.1.20-115-g3429cbf2d9cb…
Rootfs:
http://storage.kernelci.org/images/rootfs/buildroot/buildroot-baseline/2023…
* baseline.bootrr.deferred-probe-empty:
https://kernelci.org/test/case/id/6417a6817b820202e18c869a
failing since 2 days (last pass: v6.1.18-144-g88546018fee83, first fail: v6.1.19-139-g6d04fa2f2978) 2023-03-20T00:18:48.915610 + set +x 2023-03-20T00:18:48.919147 <8>[ 18.132154] <LAVA_SIGNAL_ENDRUN 0_dmesg 189522_1.5.2.4.1> 2023-03-20T00:18:49.036025 / # # 2023-03-20T00:18:49.138668 export SHELL=/bin/sh 2023-03-20T00:18:49.139251 # 2023-03-20T00:18:49.241240 / # export SHELL=/bin/sh. /lava-189522/environment 2023-03-20T00:18:49.242162 2023-03-20T00:18:49.344491 / # . /lava-189522/environment/lava-189522/bin/lava-test-runner /lava-189522/1 2023-03-20T00:18:49.345671 2023-03-20T00:18:49.351519 / # /lava-189522/bin/lava-test-runner /lava-189522/1 ... (14 line(s) more) platform | arch | lab | compiler | defconfig | regressions -------------------+------+---------------+----------+-------------------+------------ tegra124-nyan-big | arm | lab-collabora | gcc-10 | tegra_defconfig | 1 Details:
https://kernelci.org/test/plan/id/6417a988d405e7ae418c8655
Results: 0 PASS, 1 FAIL, 0 SKIP Full config: tegra_defconfig Compiler: gcc-10 (arm-linux-gnueabihf-gcc (Debian 10.2.1-6) 10.2.1 20210110) Plain log:
https://storage.kernelci.org//stable-rc/queue-6.1/v6.1.20-115-g3429cbf2d9cb…
HTML log:
https://storage.kernelci.org//stable-rc/queue-6.1/v6.1.20-115-g3429cbf2d9cb…
Rootfs:
http://storage.kernelci.org/images/rootfs/buildroot/buildroot-baseline/2023…
* baseline.login:
https://kernelci.org/test/case/id/6417a988d405e7ae418c8656
new failure (last pass: v6.1.20-92-g2d61a6c64e31)
1 year, 11 months
1
0
0
0
stable-rc/queue/5.10 baseline: 118 runs, 9 regressions (v5.10.175-55-ge66cfb4eaff0)
by kernelci.org bot
stable-rc/queue/5.10 baseline: 118 runs, 9 regressions (v5.10.175-55-ge66cfb4eaff0) Regressions Summary ------------------- platform | arch | lab | compiler | defconfig | regressions -----------------------------+--------+---------------+----------+------------------------------+------------ asus-C433TA-AJ0005-rammus | x86_64 | lab-collabora | gcc-10 | x86_64_defcon...6-chromebook | 1 asus-C436FA-Flip-hatch | x86_64 | lab-collabora | gcc-10 | x86_64_defcon...6-chromebook | 1 asus-cx9400-volteer | x86_64 | lab-collabora | gcc-10 | x86_64_defcon...6-chromebook | 1 beaglebone-black | arm | lab-broonie | gcc-10 | omap2plus_defconfig | 1 cubietruck | arm | lab-baylibre | gcc-10 | multi_v7_defconfig | 1 dell-latitude...4305U-sarien | x86_64 | lab-collabora | gcc-10 | x86_64_defcon...6-chromebook | 1 dell-latitude...8665U-sarien | x86_64 | lab-collabora | gcc-10 | x86_64_defcon...6-chromebook | 1 hp-x360-14-G1-sona | x86_64 | lab-collabora | gcc-10 | x86_64_defcon...6-chromebook | 1 sun8i-h3-libretech-all-h3-cc | arm | lab-baylibre | gcc-10 | multi_v7_defconfig | 1 Details:
https://kernelci.org/test/job/stable-rc/branch/queue%2F5.10/kernel/v5.10.17…
Test: baseline Tree: stable-rc Branch: queue/5.10 Describe: v5.10.175-55-ge66cfb4eaff0 URL:
https://git.kernel.org/pub/scm/linux/kernel/git/stable/linux-stable-rc.git
SHA: e66cfb4eaff04dbc0dc044b41634d4fe4a0b7cb0 Test Regressions ---------------- platform | arch | lab | compiler | defconfig | regressions -----------------------------+--------+---------------+----------+------------------------------+------------ asus-C433TA-AJ0005-rammus | x86_64 | lab-collabora | gcc-10 | x86_64_defcon...6-chromebook | 1 Details:
https://kernelci.org/test/plan/id/6417a3d9f9c5e1a1d08c8673
Results: 0 PASS, 1 FAIL, 0 SKIP Full config: x86_64_defconfig+x86-chromebook Compiler: gcc-10 (gcc (Debian 10.2.1-6) 10.2.1 20210110) Plain log:
https://storage.kernelci.org//stable-rc/queue-5.10/v5.10.175-55-ge66cfb4eaf…
HTML log:
https://storage.kernelci.org//stable-rc/queue-5.10/v5.10.175-55-ge66cfb4eaf…
Rootfs:
http://storage.kernelci.org/images/rootfs/buildroot/buildroot-baseline/2023…
* baseline.login:
https://kernelci.org/test/case/id/6417a3d9f9c5e1a1d08c8674
failing since 4 days (last pass: v5.10.173-89-gbb0818a7908b, first fail: v5.10.173-107-gce2ebcbb3458) platform | arch | lab | compiler | defconfig | regressions -----------------------------+--------+---------------+----------+------------------------------+------------ asus-C436FA-Flip-hatch | x86_64 | lab-collabora | gcc-10 | x86_64_defcon...6-chromebook | 1 Details:
https://kernelci.org/test/plan/id/6417a3d8f9c5e1a1d08c8659
Results: 0 PASS, 1 FAIL, 0 SKIP Full config: x86_64_defconfig+x86-chromebook Compiler: gcc-10 (gcc (Debian 10.2.1-6) 10.2.1 20210110) Plain log:
https://storage.kernelci.org//stable-rc/queue-5.10/v5.10.175-55-ge66cfb4eaf…
HTML log:
https://storage.kernelci.org//stable-rc/queue-5.10/v5.10.175-55-ge66cfb4eaf…
Rootfs:
http://storage.kernelci.org/images/rootfs/buildroot/buildroot-baseline/2023…
* baseline.login:
https://kernelci.org/test/case/id/6417a3d8f9c5e1a1d08c865a
failing since 4 days (last pass: v5.10.173-89-gbb0818a7908b, first fail: v5.10.173-107-gce2ebcbb3458) platform | arch | lab | compiler | defconfig | regressions -----------------------------+--------+---------------+----------+------------------------------+------------ asus-cx9400-volteer | x86_64 | lab-collabora | gcc-10 | x86_64_defcon...6-chromebook | 1 Details:
https://kernelci.org/test/plan/id/6417a3d9f9c5e1a1d08c8670
Results: 0 PASS, 1 FAIL, 0 SKIP Full config: x86_64_defconfig+x86-chromebook Compiler: gcc-10 (gcc (Debian 10.2.1-6) 10.2.1 20210110) Plain log:
https://storage.kernelci.org//stable-rc/queue-5.10/v5.10.175-55-ge66cfb4eaf…
HTML log:
https://storage.kernelci.org//stable-rc/queue-5.10/v5.10.175-55-ge66cfb4eaf…
Rootfs:
http://storage.kernelci.org/images/rootfs/buildroot/buildroot-baseline/2023…
* baseline.login:
https://kernelci.org/test/case/id/6417a3d9f9c5e1a1d08c8671
failing since 4 days (last pass: v5.10.173-89-gbb0818a7908b, first fail: v5.10.173-107-gce2ebcbb3458) platform | arch | lab | compiler | defconfig | regressions -----------------------------+--------+---------------+----------+------------------------------+------------ beaglebone-black | arm | lab-broonie | gcc-10 | omap2plus_defconfig | 1 Details:
https://kernelci.org/test/plan/id/6417a488b31fb333cc8c8632
Results: 51 PASS, 4 FAIL, 1 SKIP Full config: omap2plus_defconfig Compiler: gcc-10 (arm-linux-gnueabihf-gcc (Debian 10.2.1-6) 10.2.1 20210110) Plain log:
https://storage.kernelci.org//stable-rc/queue-5.10/v5.10.175-55-ge66cfb4eaf…
HTML log:
https://storage.kernelci.org//stable-rc/queue-5.10/v5.10.175-55-ge66cfb4eaf…
Rootfs:
http://storage.kernelci.org/images/rootfs/buildroot/buildroot-baseline/2023…
* baseline.bootrr.deferred-probe-empty:
https://kernelci.org/test/case/id/6417a488b31fb333cc8c866b
failing since 34 days (last pass: v5.10.167-127-g921934d621e4, first fail: v5.10.167-139-gf9519a5a1701) 2023-03-20T00:10:31.007500 <8>[ 19.917502] <LAVA_SIGNAL_ENDRUN 0_dmesg 189473_1.5.2.4.1> 2023-03-20T00:10:31.117796 / # # 2023-03-20T00:10:31.220002 export SHELL=/bin/sh 2023-03-20T00:10:31.220587 # 2023-03-20T00:10:31.322144 / # export SHELL=/bin/sh. /lava-189473/environment 2023-03-20T00:10:31.322713 2023-03-20T00:10:31.424338 / # . /lava-189473/environment/lava-189473/bin/lava-test-runner /lava-189473/1 2023-03-20T00:10:31.425302 2023-03-20T00:10:31.429936 / # /lava-189473/bin/lava-test-runner /lava-189473/1 2023-03-20T00:10:31.537231 + export 'TESTRUN_ID=1_bootrr' ... (11 line(s) more) platform | arch | lab | compiler | defconfig | regressions -----------------------------+--------+---------------+----------+------------------------------+------------ cubietruck | arm | lab-baylibre | gcc-10 | multi_v7_defconfig | 1 Details:
https://kernelci.org/test/plan/id/6417a4dbce798e5f4c8c8644
Results: 5 PASS, 1 FAIL, 1 SKIP Full config: multi_v7_defconfig Compiler: gcc-10 (arm-linux-gnueabihf-gcc (Debian 10.2.1-6) 10.2.1 20210110) Plain log:
https://storage.kernelci.org//stable-rc/queue-5.10/v5.10.175-55-ge66cfb4eaf…
HTML log:
https://storage.kernelci.org//stable-rc/queue-5.10/v5.10.175-55-ge66cfb4eaf…
Rootfs:
http://storage.kernelci.org/images/rootfs/buildroot/buildroot-baseline/2023…
* baseline.bootrr.deferred-probe-empty:
https://kernelci.org/test/case/id/6417a4dbce798e5f4c8c864d
failing since 52 days (last pass: v5.10.165-76-g5c2e982fcf18, first fail: v5.10.165-77-g4600242c13ed) 2023-03-20T00:11:52.834137 <8>[ 11.046430] <LAVA_SIGNAL_ENDRUN 0_dmesg 3426735_1.5.2.4.1> 2023-03-20T00:11:52.943266 / # # 2023-03-20T00:11:53.053932 export SHELL=/bin/sh 2023-03-20T00:11:53.054425 # 2023-03-20T00:11:53.155924 / # export SHELL=/bin/sh. /lava-3426735/environment 2023-03-20T00:11:53.156707 2023-03-20T00:11:53.258564 / # . /lava-3426735/environment/lava-3426735/bin/lava-test-runner /lava-3426735/1 2023-03-20T00:11:53.259106 <3>[ 11.371972] Bluetooth: hci0: command 0xfc18 tx timeout 2023-03-20T00:11:53.259243 2023-03-20T00:11:53.264103 / # /lava-3426735/bin/lava-test-runner /lava-3426735/1 ... (12 line(s) more) platform | arch | lab | compiler | defconfig | regressions -----------------------------+--------+---------------+----------+------------------------------+------------ dell-latitude...4305U-sarien | x86_64 | lab-collabora | gcc-10 | x86_64_defcon...6-chromebook | 1 Details:
https://kernelci.org/test/plan/id/6417a3d7f9c5e1a1d08c8656
Results: 0 PASS, 1 FAIL, 0 SKIP Full config: x86_64_defconfig+x86-chromebook Compiler: gcc-10 (gcc (Debian 10.2.1-6) 10.2.1 20210110) Plain log:
https://storage.kernelci.org//stable-rc/queue-5.10/v5.10.175-55-ge66cfb4eaf…
HTML log:
https://storage.kernelci.org//stable-rc/queue-5.10/v5.10.175-55-ge66cfb4eaf…
Rootfs:
http://storage.kernelci.org/images/rootfs/buildroot/buildroot-baseline/2023…
* baseline.login:
https://kernelci.org/test/case/id/6417a3d7f9c5e1a1d08c8657
failing since 4 days (last pass: v5.10.173-89-gbb0818a7908b, first fail: v5.10.173-107-gce2ebcbb3458) platform | arch | lab | compiler | defconfig | regressions -----------------------------+--------+---------------+----------+------------------------------+------------ dell-latitude...8665U-sarien | x86_64 | lab-collabora | gcc-10 | x86_64_defcon...6-chromebook | 1 Details:
https://kernelci.org/test/plan/id/6417a3daf9c5e1a1d08c8676
Results: 0 PASS, 1 FAIL, 0 SKIP Full config: x86_64_defconfig+x86-chromebook Compiler: gcc-10 (gcc (Debian 10.2.1-6) 10.2.1 20210110) Plain log:
https://storage.kernelci.org//stable-rc/queue-5.10/v5.10.175-55-ge66cfb4eaf…
HTML log:
https://storage.kernelci.org//stable-rc/queue-5.10/v5.10.175-55-ge66cfb4eaf…
Rootfs:
http://storage.kernelci.org/images/rootfs/buildroot/buildroot-baseline/2023…
* baseline.login:
https://kernelci.org/test/case/id/6417a3daf9c5e1a1d08c8677
failing since 4 days (last pass: v5.10.173-89-gbb0818a7908b, first fail: v5.10.173-107-gce2ebcbb3458) platform | arch | lab | compiler | defconfig | regressions -----------------------------+--------+---------------+----------+------------------------------+------------ hp-x360-14-G1-sona | x86_64 | lab-collabora | gcc-10 | x86_64_defcon...6-chromebook | 1 Details:
https://kernelci.org/test/plan/id/6417a504d14182289e8c862f
Results: 0 PASS, 1 FAIL, 0 SKIP Full config: x86_64_defconfig+x86-chromebook Compiler: gcc-10 (gcc (Debian 10.2.1-6) 10.2.1 20210110) Plain log:
https://storage.kernelci.org//stable-rc/queue-5.10/v5.10.175-55-ge66cfb4eaf…
HTML log:
https://storage.kernelci.org//stable-rc/queue-5.10/v5.10.175-55-ge66cfb4eaf…
Rootfs:
http://storage.kernelci.org/images/rootfs/buildroot/buildroot-baseline/2023…
* baseline.login:
https://kernelci.org/test/case/id/6417a504d14182289e8c8630
failing since 4 days (last pass: v5.10.173-89-gbb0818a7908b, first fail: v5.10.173-107-gce2ebcbb3458) platform | arch | lab | compiler | defconfig | regressions -----------------------------+--------+---------------+----------+------------------------------+------------ sun8i-h3-libretech-all-h3-cc | arm | lab-baylibre | gcc-10 | multi_v7_defconfig | 1 Details:
https://kernelci.org/test/plan/id/6417a49fb31fb333cc8c869c
Results: 5 PASS, 1 FAIL, 1 SKIP Full config: multi_v7_defconfig Compiler: gcc-10 (arm-linux-gnueabihf-gcc (Debian 10.2.1-6) 10.2.1 20210110) Plain log:
https://storage.kernelci.org//stable-rc/queue-5.10/v5.10.175-55-ge66cfb4eaf…
HTML log:
https://storage.kernelci.org//stable-rc/queue-5.10/v5.10.175-55-ge66cfb4eaf…
Rootfs:
http://storage.kernelci.org/images/rootfs/buildroot/buildroot-baseline/2023…
* baseline.bootrr.deferred-probe-empty:
https://kernelci.org/test/case/id/6417a49fb31fb333cc8c86a5
failing since 46 days (last pass: v5.10.165-139-gefb57ce0f880, first fail: v5.10.165-149-ge30e8271d674) 2023-03-20T00:10:47.733059 / # # 2023-03-20T00:10:47.834898 export SHELL=/bin/sh 2023-03-20T00:10:47.835413 # 2023-03-20T00:10:47.936807 / # export SHELL=/bin/sh. /lava-3426732/environment 2023-03-20T00:10:47.937332 2023-03-20T00:10:48.038713 / # . /lava-3426732/environment/lava-3426732/bin/lava-test-runner /lava-3426732/1 2023-03-20T00:10:48.039507 2023-03-20T00:10:48.044094 / # /lava-3426732/bin/lava-test-runner /lava-3426732/1 2023-03-20T00:10:48.108156 + export 'TESTRUN_ID=1_bootrr' 2023-03-20T00:10:48.147947 + cd /lava-3426732/1/tests/1_bootrr ... (10 line(s) more)
1 year, 11 months
1
0
0
0
stable-rc/queue/4.19 build: 197 builds: 5 failed, 192 passed, 28 warnings (v4.19.278-27-g4ae6f3fcabf8)
by kernelci.org bot
stable-rc/queue/4.19 build: 197 builds: 5 failed, 192 passed, 28 warnings (v4.19.278-27-g4ae6f3fcabf8) Full Build Summary:
https://kernelci.org/build/stable-rc/branch/queue%2F4.19/kernel/v4.19.278-2…
Tree: stable-rc Branch: queue/4.19 Git Describe: v4.19.278-27-g4ae6f3fcabf8 Git Commit: 4ae6f3fcabf8b0a13a286ce3e7fa27d05fc3b2fb Git URL:
https://git.kernel.org/pub/scm/linux/kernel/git/stable/linux-stable-rc.git
Built: 7 unique architectures Build Failures Detected: mips: ip27_defconfig: (gcc-10) FAIL ip28_defconfig: (gcc-10) FAIL riscv: allnoconfig: (gcc-10) FAIL defconfig: (gcc-10) FAIL tinyconfig: (gcc-10) FAIL Warnings Detected: arc: arm64: defconfig (gcc-10): 3 warnings defconfig+arm64-chromebook (gcc-10): 3 warnings arm: omap1_defconfig (gcc-10): 1 warning i386: allnoconfig (gcc-10): 2 warnings i386_defconfig (gcc-10): 2 warnings tinyconfig (gcc-10): 2 warnings mips: lemote2f_defconfig (gcc-10): 1 warning loongson3_defconfig (gcc-10): 1 warning malta_qemu_32r6_defconfig (gcc-10): 1 warning mtx1_defconfig (gcc-10): 3 warnings nlm_xlp_defconfig (gcc-10): 1 warning riscv: x86_64: allnoconfig (gcc-10): 2 warnings tinyconfig (gcc-10): 2 warnings x86_64_defconfig (gcc-10): 2 warnings x86_64_defconfig+x86-chromebook (gcc-10): 2 warnings Warnings summary: 7 ld: warning: creating DT_TEXTREL in a PIE 6 aarch64-linux-gnu-ld: warning: -z norelro ignored 4 ld: arch/x86/boot/compressed/head_64.o: warning: relocation in read-only section `.head.text' 3 ld: arch/x86/boot/compressed/head_32.o: warning: relocation in read-only section `.head.text' 2 sound/pci/echoaudio/echoaudio_dsp.c:647:9: warning: iteration 1073741824 invokes undefined behavior [-Waggressive-loop-optimizations] 2 net/core/rtnetlink.c:3199:1: warning: the frame size of 1328 bytes is larger than 1024 bytes [-Wframe-larger-than=] 1 {standard input}:132: Warning: macro instruction expanded into multiple instructions 1 sound/pci/echoaudio/echoaudio_dsp.c:658:9: warning: iteration 1073741824 invokes undefined behavior [-Waggressive-loop-optimizations] 1 net/core/rtnetlink.c:3199:1: warning: the frame size of 1344 bytes is larger than 1024 bytes [-Wframe-larger-than=] 1 drivers/gpio/gpio-omap.c:1233:34: warning: array ‘omap_gpio_match’ assumed to have one element Section mismatches summary: 13 WARNING: modpost: Found 1 section mismatch(es). ================================================================================ Detailed per-defconfig build reports: -------------------------------------------------------------------------------- 32r2el_defconfig (mips, gcc-10) — PASS, 0 errors, 0 warnings, 0 section mismatches -------------------------------------------------------------------------------- acs5k_defconfig (arm, gcc-10) — PASS, 0 errors, 0 warnings, 0 section mismatches -------------------------------------------------------------------------------- acs5k_tiny_defconfig (arm, gcc-10) — PASS, 0 errors, 0 warnings, 0 section mismatches -------------------------------------------------------------------------------- allnoconfig (arc, gcc-10) — PASS, 0 errors, 0 warnings, 0 section mismatches -------------------------------------------------------------------------------- allnoconfig (i386, gcc-10) — PASS, 0 errors, 2 warnings, 0 section mismatches Warnings: ld: arch/x86/boot/compressed/head_32.o: warning: relocation in read-only section `.head.text' ld: warning: creating DT_TEXTREL in a PIE -------------------------------------------------------------------------------- allnoconfig (x86_64, gcc-10) — PASS, 0 errors, 2 warnings, 0 section mismatches Warnings: ld: arch/x86/boot/compressed/head_64.o: warning: relocation in read-only section `.head.text' ld: warning: creating DT_TEXTREL in a PIE -------------------------------------------------------------------------------- allnoconfig (riscv, gcc-10) — FAIL, 0 errors, 0 warnings, 0 section mismatches -------------------------------------------------------------------------------- am200epdkit_defconfig (arm, gcc-10) — PASS, 0 errors, 0 warnings, 0 section mismatches -------------------------------------------------------------------------------- ar7_defconfig (mips, gcc-10) — PASS, 0 errors, 0 warnings, 0 section mismatches -------------------------------------------------------------------------------- aspeed_g4_defconfig (arm, gcc-10) — PASS, 0 errors, 0 warnings, 0 section mismatches -------------------------------------------------------------------------------- aspeed_g5_defconfig (arm, gcc-10) — PASS, 0 errors, 0 warnings, 0 section mismatches -------------------------------------------------------------------------------- assabet_defconfig (arm, gcc-10) — PASS, 0 errors, 0 warnings, 0 section mismatches -------------------------------------------------------------------------------- at91_dt_defconfig (arm, gcc-10) — PASS, 0 errors, 0 warnings, 0 section mismatches -------------------------------------------------------------------------------- ath25_defconfig (mips, gcc-10) — PASS, 0 errors, 0 warnings, 0 section mismatches -------------------------------------------------------------------------------- ath79_defconfig (mips, gcc-10) — PASS, 0 errors, 0 warnings, 0 section mismatches -------------------------------------------------------------------------------- axm55xx_defconfig (arm, gcc-10) — PASS, 0 errors, 0 warnings, 0 section mismatches -------------------------------------------------------------------------------- axs103_defconfig (arc, gcc-10) — PASS, 0 errors, 0 warnings, 0 section mismatches -------------------------------------------------------------------------------- axs103_smp_defconfig (arc, gcc-10) — PASS, 0 errors, 0 warnings, 0 section mismatches -------------------------------------------------------------------------------- badge4_defconfig (arm, gcc-10) — PASS, 0 errors, 0 warnings, 0 section mismatches -------------------------------------------------------------------------------- bcm2835_defconfig (arm, gcc-10) — PASS, 0 errors, 0 warnings, 0 section mismatches -------------------------------------------------------------------------------- bcm47xx_defconfig (mips, gcc-10) — PASS, 0 errors, 0 warnings, 0 section mismatches -------------------------------------------------------------------------------- bcm63xx_defconfig (mips, gcc-10) — PASS, 0 errors, 0 warnings, 0 section mismatches -------------------------------------------------------------------------------- bigsur_defconfig (mips, gcc-10) — PASS, 0 errors, 0 warnings, 0 section mismatches -------------------------------------------------------------------------------- bmips_be_defconfig (mips, gcc-10) — PASS, 0 errors, 0 warnings, 0 section mismatches -------------------------------------------------------------------------------- bmips_stb_defconfig (mips, gcc-10) — PASS, 0 errors, 0 warnings, 0 section mismatches -------------------------------------------------------------------------------- capcella_defconfig (mips, gcc-10) — PASS, 0 errors, 0 warnings, 0 section mismatches -------------------------------------------------------------------------------- cavium_octeon_defconfig (mips, gcc-10) — PASS, 0 errors, 0 warnings, 0 section mismatches -------------------------------------------------------------------------------- cerfcube_defconfig (arm, gcc-10) — PASS, 0 errors, 0 warnings, 0 section mismatches -------------------------------------------------------------------------------- ci20_defconfig (mips, gcc-10) — PASS, 0 errors, 0 warnings, 0 section mismatches -------------------------------------------------------------------------------- cm_x2xx_defconfig (arm, gcc-10) — PASS, 0 errors, 0 warnings, 0 section mismatches -------------------------------------------------------------------------------- cm_x300_defconfig (arm, gcc-10) — PASS, 0 errors, 0 warnings, 0 section mismatches -------------------------------------------------------------------------------- cobalt_defconfig (mips, gcc-10) — PASS, 0 errors, 0 warnings, 0 section mismatches -------------------------------------------------------------------------------- colibri_pxa270_defconfig (arm, gcc-10) — PASS, 0 errors, 0 warnings, 0 section mismatches -------------------------------------------------------------------------------- colibri_pxa300_defconfig (arm, gcc-10) — PASS, 0 errors, 0 warnings, 0 section mismatches -------------------------------------------------------------------------------- collie_defconfig (arm, gcc-10) — PASS, 0 errors, 0 warnings, 0 section mismatches -------------------------------------------------------------------------------- corgi_defconfig (arm, gcc-10) — PASS, 0 errors, 0 warnings, 0 section mismatches -------------------------------------------------------------------------------- davinci_all_defconfig (arm, gcc-10) — PASS, 0 errors, 0 warnings, 0 section mismatches -------------------------------------------------------------------------------- db1xxx_defconfig (mips, gcc-10) — PASS, 0 errors, 0 warnings, 0 section mismatches -------------------------------------------------------------------------------- decstation_defconfig (mips, gcc-10) — PASS, 0 errors, 0 warnings, 0 section mismatches -------------------------------------------------------------------------------- defconfig (riscv, gcc-10) — FAIL, 0 errors, 0 warnings, 0 section mismatches -------------------------------------------------------------------------------- defconfig (arm64, gcc-10) — PASS, 0 errors, 3 warnings, 0 section mismatches Warnings: aarch64-linux-gnu-ld: warning: -z norelro ignored aarch64-linux-gnu-ld: warning: -z norelro ignored aarch64-linux-gnu-ld: warning: -z norelro ignored Section mismatches: WARNING: modpost: Found 1 section mismatch(es). -------------------------------------------------------------------------------- defconfig+arm64-chromebook (arm64, gcc-10) — PASS, 0 errors, 3 warnings, 0 section mismatches Warnings: aarch64-linux-gnu-ld: warning: -z norelro ignored aarch64-linux-gnu-ld: warning: -z norelro ignored aarch64-linux-gnu-ld: warning: -z norelro ignored Section mismatches: WARNING: modpost: Found 1 section mismatch(es). -------------------------------------------------------------------------------- dove_defconfig (arm, gcc-10) — PASS, 0 errors, 0 warnings, 0 section mismatches -------------------------------------------------------------------------------- e55_defconfig (mips, gcc-10) — PASS, 0 errors, 0 warnings, 0 section mismatches -------------------------------------------------------------------------------- ebsa110_defconfig (arm, gcc-10) — PASS, 0 errors, 0 warnings, 0 section mismatches -------------------------------------------------------------------------------- efm32_defconfig (arm, gcc-10) — PASS, 0 errors, 0 warnings, 0 section mismatches -------------------------------------------------------------------------------- em_x270_defconfig (arm, gcc-10) — PASS, 0 errors, 0 warnings, 0 section mismatches -------------------------------------------------------------------------------- ep93xx_defconfig (arm, gcc-10) — PASS, 0 errors, 0 warnings, 0 section mismatches Section mismatches: WARNING: modpost: Found 1 section mismatch(es). -------------------------------------------------------------------------------- eseries_pxa_defconfig (arm, gcc-10) — PASS, 0 errors, 0 warnings, 0 section mismatches -------------------------------------------------------------------------------- exynos_defconfig (arm, gcc-10) — PASS, 0 errors, 0 warnings, 0 section mismatches -------------------------------------------------------------------------------- ezx_defconfig (arm, gcc-10) — PASS, 0 errors, 0 warnings, 0 section mismatches -------------------------------------------------------------------------------- footbridge_defconfig (arm, gcc-10) — PASS, 0 errors, 0 warnings, 0 section mismatches -------------------------------------------------------------------------------- fuloong2e_defconfig (mips, gcc-10) — PASS, 0 errors, 0 warnings, 0 section mismatches -------------------------------------------------------------------------------- gcw0_defconfig (mips, gcc-10) — PASS, 0 errors, 0 warnings, 0 section mismatches -------------------------------------------------------------------------------- gemini_defconfig (arm, gcc-10) — PASS, 0 errors, 0 warnings, 0 section mismatches -------------------------------------------------------------------------------- gpr_defconfig (mips, gcc-10) — PASS, 0 errors, 0 warnings, 0 section mismatches -------------------------------------------------------------------------------- h3600_defconfig (arm, gcc-10) — PASS, 0 errors, 0 warnings, 0 section mismatches -------------------------------------------------------------------------------- h5000_defconfig (arm, gcc-10) — PASS, 0 errors, 0 warnings, 0 section mismatches -------------------------------------------------------------------------------- hackkit_defconfig (arm, gcc-10) — PASS, 0 errors, 0 warnings, 0 section mismatches -------------------------------------------------------------------------------- haps_hs_defconfig (arc, gcc-10) — PASS, 0 errors, 0 warnings, 0 section mismatches -------------------------------------------------------------------------------- haps_hs_smp_defconfig (arc, gcc-10) — PASS, 0 errors, 0 warnings, 0 section mismatches -------------------------------------------------------------------------------- hisi_defconfig (arm, gcc-10) — PASS, 0 errors, 0 warnings, 0 section mismatches -------------------------------------------------------------------------------- hsdk_defconfig (arc, gcc-10) — PASS, 0 errors, 0 warnings, 0 section mismatches -------------------------------------------------------------------------------- i386_defconfig (i386, gcc-10) — PASS, 0 errors, 2 warnings, 0 section mismatches Warnings: ld: arch/x86/boot/compressed/head_32.o: warning: relocation in read-only section `.head.text' ld: warning: creating DT_TEXTREL in a PIE -------------------------------------------------------------------------------- imote2_defconfig (arm, gcc-10) — PASS, 0 errors, 0 warnings, 0 section mismatches -------------------------------------------------------------------------------- imx_v4_v5_defconfig (arm, gcc-10) — PASS, 0 errors, 0 warnings, 0 section mismatches -------------------------------------------------------------------------------- imx_v6_v7_defconfig (arm, gcc-10) — PASS, 0 errors, 0 warnings, 0 section mismatches -------------------------------------------------------------------------------- integrator_defconfig (arm, gcc-10) — PASS, 0 errors, 0 warnings, 0 section mismatches Section mismatches: WARNING: modpost: Found 1 section mismatch(es). -------------------------------------------------------------------------------- iop13xx_defconfig (arm, gcc-10) — PASS, 0 errors, 0 warnings, 0 section mismatches -------------------------------------------------------------------------------- iop32x_defconfig (arm, gcc-10) — PASS, 0 errors, 0 warnings, 0 section mismatches -------------------------------------------------------------------------------- iop33x_defconfig (arm, gcc-10) — PASS, 0 errors, 0 warnings, 0 section mismatches -------------------------------------------------------------------------------- ip22_defconfig (mips, gcc-10) — PASS, 0 errors, 0 warnings, 0 section mismatches -------------------------------------------------------------------------------- ip27_defconfig (mips, gcc-10) — FAIL, 0 errors, 0 warnings, 0 section mismatches -------------------------------------------------------------------------------- ip28_defconfig (mips, gcc-10) — FAIL, 0 errors, 0 warnings, 0 section mismatches -------------------------------------------------------------------------------- ip32_defconfig (mips, gcc-10) — PASS, 0 errors, 0 warnings, 0 section mismatches -------------------------------------------------------------------------------- ixp4xx_defconfig (arm, gcc-10) — PASS, 0 errors, 0 warnings, 0 section mismatches -------------------------------------------------------------------------------- jazz_defconfig (mips, gcc-10) — PASS, 0 errors, 0 warnings, 0 section mismatches -------------------------------------------------------------------------------- jmr3927_defconfig (mips, gcc-10) — PASS, 0 errors, 0 warnings, 0 section mismatches -------------------------------------------------------------------------------- jornada720_defconfig (arm, gcc-10) — PASS, 0 errors, 0 warnings, 0 section mismatches -------------------------------------------------------------------------------- keystone_defconfig (arm, gcc-10) — PASS, 0 errors, 0 warnings, 0 section mismatches -------------------------------------------------------------------------------- ks8695_defconfig (arm, gcc-10) — PASS, 0 errors, 0 warnings, 0 section mismatches -------------------------------------------------------------------------------- lart_defconfig (arm, gcc-10) — PASS, 0 errors, 0 warnings, 0 section mismatches -------------------------------------------------------------------------------- lasat_defconfig (mips, gcc-10) — PASS, 0 errors, 0 warnings, 0 section mismatches -------------------------------------------------------------------------------- lemote2f_defconfig (mips, gcc-10) — PASS, 0 errors, 1 warning, 0 section mismatches Warnings: net/core/rtnetlink.c:3199:1: warning: the frame size of 1328 bytes is larger than 1024 bytes [-Wframe-larger-than=] -------------------------------------------------------------------------------- loongson1b_defconfig (mips, gcc-10) — PASS, 0 errors, 0 warnings, 0 section mismatches -------------------------------------------------------------------------------- loongson1c_defconfig (mips, gcc-10) — PASS, 0 errors, 0 warnings, 0 section mismatches -------------------------------------------------------------------------------- loongson3_defconfig (mips, gcc-10) — PASS, 0 errors, 1 warning, 0 section mismatches Warnings: net/core/rtnetlink.c:3199:1: warning: the frame size of 1328 bytes is larger than 1024 bytes [-Wframe-larger-than=] -------------------------------------------------------------------------------- lpc18xx_defconfig (arm, gcc-10) — PASS, 0 errors, 0 warnings, 0 section mismatches -------------------------------------------------------------------------------- lpc32xx_defconfig (arm, gcc-10) — PASS, 0 errors, 0 warnings, 0 section mismatches -------------------------------------------------------------------------------- lpd270_defconfig (arm, gcc-10) — PASS, 0 errors, 0 warnings, 0 section mismatches -------------------------------------------------------------------------------- lubbock_defconfig (arm, gcc-10) — PASS, 0 errors, 0 warnings, 0 section mismatches -------------------------------------------------------------------------------- magician_defconfig (arm, gcc-10) — PASS, 0 errors, 0 warnings, 0 section mismatches -------------------------------------------------------------------------------- mainstone_defconfig (arm, gcc-10) — PASS, 0 errors, 0 warnings, 0 section mismatches -------------------------------------------------------------------------------- malta_defconfig (mips, gcc-10) — PASS, 0 errors, 0 warnings, 0 section mismatches -------------------------------------------------------------------------------- malta_kvm_defconfig (mips, gcc-10) — PASS, 0 errors, 0 warnings, 0 section mismatches -------------------------------------------------------------------------------- malta_kvm_guest_defconfig (mips, gcc-10) — PASS, 0 errors, 0 warnings, 0 section mismatches -------------------------------------------------------------------------------- malta_qemu_32r6_defconfig (mips, gcc-10) — PASS, 0 errors, 1 warning, 0 section mismatches Warnings: {standard input}:132: Warning: macro instruction expanded into multiple instructions -------------------------------------------------------------------------------- maltaaprp_defconfig (mips, gcc-10) — PASS, 0 errors, 0 warnings, 0 section mismatches -------------------------------------------------------------------------------- maltasmvp_defconfig (mips, gcc-10) — PASS, 0 errors, 0 warnings, 0 section mismatches -------------------------------------------------------------------------------- maltasmvp_eva_defconfig (mips, gcc-10) — PASS, 0 errors, 0 warnings, 0 section mismatches -------------------------------------------------------------------------------- maltaup_defconfig (mips, gcc-10) — PASS, 0 errors, 0 warnings, 0 section mismatches -------------------------------------------------------------------------------- maltaup_xpa_defconfig (mips, gcc-10) — PASS, 0 errors, 0 warnings, 0 section mismatches -------------------------------------------------------------------------------- markeins_defconfig (mips, gcc-10) — PASS, 0 errors, 0 warnings, 0 section mismatches -------------------------------------------------------------------------------- mini2440_defconfig (arm, gcc-10) — PASS, 0 errors, 0 warnings, 0 section mismatches -------------------------------------------------------------------------------- mips_paravirt_defconfig (mips, gcc-10) — PASS, 0 errors, 0 warnings, 0 section mismatches -------------------------------------------------------------------------------- mmp2_defconfig (arm, gcc-10) — PASS, 0 errors, 0 warnings, 0 section mismatches -------------------------------------------------------------------------------- moxart_defconfig (arm, gcc-10) — PASS, 0 errors, 0 warnings, 0 section mismatches -------------------------------------------------------------------------------- mpc30x_defconfig (mips, gcc-10) — PASS, 0 errors, 0 warnings, 0 section mismatches -------------------------------------------------------------------------------- mps2_defconfig (arm, gcc-10) — PASS, 0 errors, 0 warnings, 0 section mismatches -------------------------------------------------------------------------------- msp71xx_defconfig (mips, gcc-10) — PASS, 0 errors, 0 warnings, 0 section mismatches -------------------------------------------------------------------------------- mtx1_defconfig (mips, gcc-10) — PASS, 0 errors, 3 warnings, 0 section mismatches Warnings: sound/pci/echoaudio/echoaudio_dsp.c:647:9: warning: iteration 1073741824 invokes undefined behavior [-Waggressive-loop-optimizations] sound/pci/echoaudio/echoaudio_dsp.c:658:9: warning: iteration 1073741824 invokes undefined behavior [-Waggressive-loop-optimizations] sound/pci/echoaudio/echoaudio_dsp.c:647:9: warning: iteration 1073741824 invokes undefined behavior [-Waggressive-loop-optimizations] -------------------------------------------------------------------------------- multi_v4t_defconfig (arm, gcc-10) — PASS, 0 errors, 0 warnings, 0 section mismatches -------------------------------------------------------------------------------- multi_v5_defconfig (arm, gcc-10) — PASS, 0 errors, 0 warnings, 0 section mismatches Section mismatches: WARNING: modpost: Found 1 section mismatch(es). -------------------------------------------------------------------------------- multi_v7_defconfig (arm, gcc-10) — PASS, 0 errors, 0 warnings, 0 section mismatches -------------------------------------------------------------------------------- mvebu_v5_defconfig (arm, gcc-10) — PASS, 0 errors, 0 warnings, 0 section mismatches -------------------------------------------------------------------------------- mvebu_v7_defconfig (arm, gcc-10) — PASS, 0 errors, 0 warnings, 0 section mismatches -------------------------------------------------------------------------------- mxs_defconfig (arm, gcc-10) — PASS, 0 errors, 0 warnings, 0 section mismatches -------------------------------------------------------------------------------- neponset_defconfig (arm, gcc-10) — PASS, 0 errors, 0 warnings, 0 section mismatches -------------------------------------------------------------------------------- netwinder_defconfig (arm, gcc-10) — PASS, 0 errors, 0 warnings, 0 section mismatches -------------------------------------------------------------------------------- netx_defconfig (arm, gcc-10) — PASS, 0 errors, 0 warnings, 0 section mismatches Section mismatches: WARNING: modpost: Found 1 section mismatch(es). -------------------------------------------------------------------------------- nhk8815_defconfig (arm, gcc-10) — PASS, 0 errors, 0 warnings, 0 section mismatches Section mismatches: WARNING: modpost: Found 1 section mismatch(es). -------------------------------------------------------------------------------- nlm_xlp_defconfig (mips, gcc-10) — PASS, 0 errors, 1 warning, 0 section mismatches Warnings: net/core/rtnetlink.c:3199:1: warning: the frame size of 1344 bytes is larger than 1024 bytes [-Wframe-larger-than=] -------------------------------------------------------------------------------- nlm_xlr_defconfig (mips, gcc-10) — PASS, 0 errors, 0 warnings, 0 section mismatches -------------------------------------------------------------------------------- nsim_hs_defconfig (arc, gcc-10) — PASS, 0 errors, 0 warnings, 0 section mismatches -------------------------------------------------------------------------------- nsim_hs_smp_defconfig (arc, gcc-10) — PASS, 0 errors, 0 warnings, 0 section mismatches -------------------------------------------------------------------------------- nsimosci_hs_defconfig (arc, gcc-10) — PASS, 0 errors, 0 warnings, 0 section mismatches -------------------------------------------------------------------------------- nsimosci_hs_smp_defconfig (arc, gcc-10) — PASS, 0 errors, 0 warnings, 0 section mismatches -------------------------------------------------------------------------------- nuc910_defconfig (arm, gcc-10) — PASS, 0 errors, 0 warnings, 0 section mismatches -------------------------------------------------------------------------------- nuc950_defconfig (arm, gcc-10) — PASS, 0 errors, 0 warnings, 0 section mismatches -------------------------------------------------------------------------------- nuc960_defconfig (arm, gcc-10) — PASS, 0 errors, 0 warnings, 0 section mismatches -------------------------------------------------------------------------------- omap1_defconfig (arm, gcc-10) — PASS, 0 errors, 1 warning, 0 section mismatches Warnings: drivers/gpio/gpio-omap.c:1233:34: warning: array ‘omap_gpio_match’ assumed to have one element -------------------------------------------------------------------------------- omap2plus_defconfig (arm, gcc-10) — PASS, 0 errors, 0 warnings, 0 section mismatches -------------------------------------------------------------------------------- omega2p_defconfig (mips, gcc-10) — PASS, 0 errors, 0 warnings, 0 section mismatches -------------------------------------------------------------------------------- orion5x_defconfig (arm, gcc-10) — PASS, 0 errors, 0 warnings, 0 section mismatches -------------------------------------------------------------------------------- oxnas_v6_defconfig (arm, gcc-10) — PASS, 0 errors, 0 warnings, 0 section mismatches -------------------------------------------------------------------------------- palmz72_defconfig (arm, gcc-10) — PASS, 0 errors, 0 warnings, 0 section mismatches -------------------------------------------------------------------------------- pcm027_defconfig (arm, gcc-10) — PASS, 0 errors, 0 warnings, 0 section mismatches -------------------------------------------------------------------------------- pic32mzda_defconfig (mips, gcc-10) — PASS, 0 errors, 0 warnings, 0 section mismatches -------------------------------------------------------------------------------- pistachio_defconfig (mips, gcc-10) — PASS, 0 errors, 0 warnings, 0 section mismatches -------------------------------------------------------------------------------- pleb_defconfig (arm, gcc-10) — PASS, 0 errors, 0 warnings, 0 section mismatches -------------------------------------------------------------------------------- pnx8335_stb225_defconfig (mips, gcc-10) — PASS, 0 errors, 0 warnings, 0 section mismatches -------------------------------------------------------------------------------- prima2_defconfig (arm, gcc-10) — PASS, 0 errors, 0 warnings, 0 section mismatches -------------------------------------------------------------------------------- pxa168_defconfig (arm, gcc-10) — PASS, 0 errors, 0 warnings, 0 section mismatches -------------------------------------------------------------------------------- pxa255-idp_defconfig (arm, gcc-10) — PASS, 0 errors, 0 warnings, 0 section mismatches -------------------------------------------------------------------------------- pxa3xx_defconfig (arm, gcc-10) — PASS, 0 errors, 0 warnings, 0 section mismatches -------------------------------------------------------------------------------- pxa910_defconfig (arm, gcc-10) — PASS, 0 errors, 0 warnings, 0 section mismatches -------------------------------------------------------------------------------- pxa_defconfig (arm, gcc-10) — PASS, 0 errors, 0 warnings, 0 section mismatches -------------------------------------------------------------------------------- qcom_defconfig (arm, gcc-10) — PASS, 0 errors, 0 warnings, 0 section mismatches -------------------------------------------------------------------------------- qi_lb60_defconfig (mips, gcc-10) — PASS, 0 errors, 0 warnings, 0 section mismatches -------------------------------------------------------------------------------- raumfeld_defconfig (arm, gcc-10) — PASS, 0 errors, 0 warnings, 0 section mismatches -------------------------------------------------------------------------------- rb532_defconfig (mips, gcc-10) — PASS, 0 errors, 0 warnings, 0 section mismatches -------------------------------------------------------------------------------- rbtx49xx_defconfig (mips, gcc-10) — PASS, 0 errors, 0 warnings, 0 section mismatches -------------------------------------------------------------------------------- realview_defconfig (arm, gcc-10) — PASS, 0 errors, 0 warnings, 0 section mismatches -------------------------------------------------------------------------------- rm200_defconfig (mips, gcc-10) — PASS, 0 errors, 0 warnings, 0 section mismatches -------------------------------------------------------------------------------- rt305x_defconfig (mips, gcc-10) — PASS, 0 errors, 0 warnings, 0 section mismatches -------------------------------------------------------------------------------- s3c2410_defconfig (arm, gcc-10) — PASS, 0 errors, 0 warnings, 0 section mismatches -------------------------------------------------------------------------------- s3c6400_defconfig (arm, gcc-10) — PASS, 0 errors, 0 warnings, 0 section mismatches Section mismatches: WARNING: modpost: Found 1 section mismatch(es). -------------------------------------------------------------------------------- s5pv210_defconfig (arm, gcc-10) — PASS, 0 errors, 0 warnings, 0 section mismatches Section mismatches: WARNING: modpost: Found 1 section mismatch(es). -------------------------------------------------------------------------------- sama5_defconfig (arm, gcc-10) — PASS, 0 errors, 0 warnings, 0 section mismatches -------------------------------------------------------------------------------- sb1250_swarm_defconfig (mips, gcc-10) — PASS, 0 errors, 0 warnings, 0 section mismatches -------------------------------------------------------------------------------- shannon_defconfig (arm, gcc-10) — PASS, 0 errors, 0 warnings, 0 section mismatches -------------------------------------------------------------------------------- shmobile_defconfig (arm, gcc-10) — PASS, 0 errors, 0 warnings, 0 section mismatches -------------------------------------------------------------------------------- simpad_defconfig (arm, gcc-10) — PASS, 0 errors, 0 warnings, 0 section mismatches -------------------------------------------------------------------------------- socfpga_defconfig (arm, gcc-10) — PASS, 0 errors, 0 warnings, 0 section mismatches -------------------------------------------------------------------------------- spear13xx_defconfig (arm, gcc-10) — PASS, 0 errors, 0 warnings, 0 section mismatches -------------------------------------------------------------------------------- spear3xx_defconfig (arm, gcc-10) — PASS, 0 errors, 0 warnings, 0 section mismatches Section mismatches: WARNING: modpost: Found 1 section mismatch(es). -------------------------------------------------------------------------------- spear6xx_defconfig (arm, gcc-10) — PASS, 0 errors, 0 warnings, 0 section mismatches Section mismatches: WARNING: modpost: Found 1 section mismatch(es). -------------------------------------------------------------------------------- spitz_defconfig (arm, gcc-10) — PASS, 0 errors, 0 warnings, 0 section mismatches -------------------------------------------------------------------------------- stm32_defconfig (arm, gcc-10) — PASS, 0 errors, 0 warnings, 0 section mismatches -------------------------------------------------------------------------------- sunxi_defconfig (arm, gcc-10) — PASS, 0 errors, 0 warnings, 0 section mismatches -------------------------------------------------------------------------------- tango4_defconfig (arm, gcc-10) — PASS, 0 errors, 0 warnings, 0 section mismatches -------------------------------------------------------------------------------- tb0219_defconfig (mips, gcc-10) — PASS, 0 errors, 0 warnings, 0 section mismatches -------------------------------------------------------------------------------- tb0226_defconfig (mips, gcc-10) — PASS, 0 errors, 0 warnings, 0 section mismatches -------------------------------------------------------------------------------- tb0287_defconfig (mips, gcc-10) — PASS, 0 errors, 0 warnings, 0 section mismatches -------------------------------------------------------------------------------- tct_hammer_defconfig (arm, gcc-10) — PASS, 0 errors, 0 warnings, 0 section mismatches -------------------------------------------------------------------------------- tegra_defconfig (arm, gcc-10) — PASS, 0 errors, 0 warnings, 0 section mismatches -------------------------------------------------------------------------------- tinyconfig (i386, gcc-10) — PASS, 0 errors, 2 warnings, 0 section mismatches Warnings: ld: arch/x86/boot/compressed/head_32.o: warning: relocation in read-only section `.head.text' ld: warning: creating DT_TEXTREL in a PIE -------------------------------------------------------------------------------- tinyconfig (riscv, gcc-10) — FAIL, 0 errors, 0 warnings, 0 section mismatches -------------------------------------------------------------------------------- tinyconfig (x86_64, gcc-10) — PASS, 0 errors, 2 warnings, 0 section mismatches Warnings: ld: arch/x86/boot/compressed/head_64.o: warning: relocation in read-only section `.head.text' ld: warning: creating DT_TEXTREL in a PIE -------------------------------------------------------------------------------- tinyconfig (arc, gcc-10) — PASS, 0 errors, 0 warnings, 0 section mismatches -------------------------------------------------------------------------------- trizeps4_defconfig (arm, gcc-10) — PASS, 0 errors, 0 warnings, 0 section mismatches -------------------------------------------------------------------------------- u300_defconfig (arm, gcc-10) — PASS, 0 errors, 0 warnings, 0 section mismatches Section mismatches: WARNING: modpost: Found 1 section mismatch(es). -------------------------------------------------------------------------------- u8500_defconfig (arm, gcc-10) — PASS, 0 errors, 0 warnings, 0 section mismatches -------------------------------------------------------------------------------- vdk_hs38_defconfig (arc, gcc-10) — PASS, 0 errors, 0 warnings, 0 section mismatches -------------------------------------------------------------------------------- vdk_hs38_smp_defconfig (arc, gcc-10) — PASS, 0 errors, 0 warnings, 0 section mismatches -------------------------------------------------------------------------------- versatile_defconfig (arm, gcc-10) — PASS, 0 errors, 0 warnings, 0 section mismatches Section mismatches: WARNING: modpost: Found 1 section mismatch(es). -------------------------------------------------------------------------------- vexpress_defconfig (arm, gcc-10) — PASS, 0 errors, 0 warnings, 0 section mismatches -------------------------------------------------------------------------------- vf610m4_defconfig (arm, gcc-10) — PASS, 0 errors, 0 warnings, 0 section mismatches -------------------------------------------------------------------------------- viper_defconfig (arm, gcc-10) — PASS, 0 errors, 0 warnings, 0 section mismatches -------------------------------------------------------------------------------- vocore2_defconfig (mips, gcc-10) — PASS, 0 errors, 0 warnings, 0 section mismatches -------------------------------------------------------------------------------- vt8500_v6_v7_defconfig (arm, gcc-10) — PASS, 0 errors, 0 warnings, 0 section mismatches -------------------------------------------------------------------------------- workpad_defconfig (mips, gcc-10) — PASS, 0 errors, 0 warnings, 0 section mismatches -------------------------------------------------------------------------------- x86_64_defconfig (x86_64, gcc-10) — PASS, 0 errors, 2 warnings, 0 section mismatches Warnings: ld: arch/x86/boot/compressed/head_64.o: warning: relocation in read-only section `.head.text' ld: warning: creating DT_TEXTREL in a PIE -------------------------------------------------------------------------------- x86_64_defconfig+x86-chromebook (x86_64, gcc-10) — PASS, 0 errors, 2 warnings, 0 section mismatches Warnings: ld: arch/x86/boot/compressed/head_64.o: warning: relocation in read-only section `.head.text' ld: warning: creating DT_TEXTREL in a PIE -------------------------------------------------------------------------------- xcep_defconfig (arm, gcc-10) — PASS, 0 errors, 0 warnings, 0 section mismatches -------------------------------------------------------------------------------- zeus_defconfig (arm, gcc-10) — PASS, 0 errors, 0 warnings, 0 section mismatches -------------------------------------------------------------------------------- zx_defconfig (arm, gcc-10) — PASS, 0 errors, 0 warnings, 0 section mismatches --- For more info write to <info(a)kernelci.org>
1 year, 11 months
1
0
0
0
stable-rc/queue/4.14 build: 195 builds: 2 failed, 193 passed, 28 warnings (v4.14.310-24-g818792480c07)
by kernelci.org bot
stable-rc/queue/4.14 build: 195 builds: 2 failed, 193 passed, 28 warnings (v4.14.310-24-g818792480c07) Full Build Summary:
https://kernelci.org/build/stable-rc/branch/queue%2F4.14/kernel/v4.14.310-2…
Tree: stable-rc Branch: queue/4.14 Git Describe: v4.14.310-24-g818792480c07 Git Commit: 818792480c075370833128e06b9d56b1a69cac97 Git URL:
https://git.kernel.org/pub/scm/linux/kernel/git/stable/linux-stable-rc.git
Built: 6 unique architectures Build Failures Detected: mips: ip27_defconfig: (gcc-10) FAIL ip28_defconfig: (gcc-10) FAIL Warnings Detected: arc: arm64: arm: mini2440_defconfig (gcc-10): 1 warning omap1_defconfig (gcc-10): 1 warning s3c2410_defconfig (gcc-10): 1 warning i386: allnoconfig (gcc-10): 3 warnings i386_defconfig (gcc-10): 3 warnings tinyconfig (gcc-10): 3 warnings mips: malta_qemu_32r6_defconfig (gcc-10): 1 warning mtx1_defconfig (gcc-10): 3 warnings x86_64: allnoconfig (gcc-10): 3 warnings tinyconfig (gcc-10): 3 warnings x86_64_defconfig (gcc-10): 3 warnings x86_64_defconfig+x86-chromebook (gcc-10): 3 warnings Warnings summary: 7 ld: warning: creating DT_TEXTREL in a PIE 4 ld: arch/x86/boot/compressed/head_64.o: warning: relocation in read-only section `.head.text' 4 Warning: synced file at 'tools/objtool/arch/x86/include/asm/insn.h' differs from latest kernel version at 'arch/x86/include/asm/insn.h' 3 ld: arch/x86/boot/compressed/head_32.o: warning: relocation in read-only section `.head.text' 3 arch/x86/entry/entry_32.S:480: Warning: no instruction mnemonic suffix given and no register operands; using default for `btr' 2 sound/pci/echoaudio/echoaudio_dsp.c:647:9: warning: iteration 1073741824 invokes undefined behavior [-Waggressive-loop-optimizations] 2 drivers/tty/serial/samsung.c:1790:34: warning: array ‘s3c24xx_uart_dt_match’ assumed to have one element 1 {standard input}:30: Warning: macro instruction expanded into multiple instructions 1 sound/pci/echoaudio/echoaudio_dsp.c:658:9: warning: iteration 1073741824 invokes undefined behavior [-Waggressive-loop-optimizations] 1 drivers/gpio/gpio-omap.c:1152:34: warning: array ‘omap_gpio_match’ assumed to have one element Section mismatches summary: 13 WARNING: modpost: Found 1 section mismatch(es). ================================================================================ Detailed per-defconfig build reports: -------------------------------------------------------------------------------- 32r2el_defconfig (mips, gcc-10) — PASS, 0 errors, 0 warnings, 0 section mismatches -------------------------------------------------------------------------------- acs5k_defconfig (arm, gcc-10) — PASS, 0 errors, 0 warnings, 0 section mismatches -------------------------------------------------------------------------------- acs5k_tiny_defconfig (arm, gcc-10) — PASS, 0 errors, 0 warnings, 0 section mismatches -------------------------------------------------------------------------------- allnoconfig (mips, gcc-10) — PASS, 0 errors, 0 warnings, 0 section mismatches -------------------------------------------------------------------------------- allnoconfig (arc, gcc-10) — PASS, 0 errors, 0 warnings, 0 section mismatches -------------------------------------------------------------------------------- allnoconfig (x86_64, gcc-10) — PASS, 0 errors, 3 warnings, 0 section mismatches Warnings: Warning: synced file at 'tools/objtool/arch/x86/include/asm/insn.h' differs from latest kernel version at 'arch/x86/include/asm/insn.h' ld: arch/x86/boot/compressed/head_64.o: warning: relocation in read-only section `.head.text' ld: warning: creating DT_TEXTREL in a PIE -------------------------------------------------------------------------------- allnoconfig (i386, gcc-10) — PASS, 0 errors, 3 warnings, 0 section mismatches Warnings: arch/x86/entry/entry_32.S:480: Warning: no instruction mnemonic suffix given and no register operands; using default for `btr' ld: arch/x86/boot/compressed/head_32.o: warning: relocation in read-only section `.head.text' ld: warning: creating DT_TEXTREL in a PIE -------------------------------------------------------------------------------- am200epdkit_defconfig (arm, gcc-10) — PASS, 0 errors, 0 warnings, 0 section mismatches -------------------------------------------------------------------------------- ar7_defconfig (mips, gcc-10) — PASS, 0 errors, 0 warnings, 0 section mismatches -------------------------------------------------------------------------------- aspeed_g4_defconfig (arm, gcc-10) — PASS, 0 errors, 0 warnings, 0 section mismatches -------------------------------------------------------------------------------- aspeed_g5_defconfig (arm, gcc-10) — PASS, 0 errors, 0 warnings, 0 section mismatches -------------------------------------------------------------------------------- assabet_defconfig (arm, gcc-10) — PASS, 0 errors, 0 warnings, 0 section mismatches -------------------------------------------------------------------------------- at91_dt_defconfig (arm, gcc-10) — PASS, 0 errors, 0 warnings, 0 section mismatches -------------------------------------------------------------------------------- ath25_defconfig (mips, gcc-10) — PASS, 0 errors, 0 warnings, 0 section mismatches -------------------------------------------------------------------------------- ath79_defconfig (mips, gcc-10) — PASS, 0 errors, 0 warnings, 0 section mismatches -------------------------------------------------------------------------------- axm55xx_defconfig (arm, gcc-10) — PASS, 0 errors, 0 warnings, 0 section mismatches -------------------------------------------------------------------------------- axs103_defconfig (arc, gcc-10) — PASS, 0 errors, 0 warnings, 0 section mismatches -------------------------------------------------------------------------------- axs103_smp_defconfig (arc, gcc-10) — PASS, 0 errors, 0 warnings, 0 section mismatches -------------------------------------------------------------------------------- badge4_defconfig (arm, gcc-10) — PASS, 0 errors, 0 warnings, 0 section mismatches -------------------------------------------------------------------------------- bcm2835_defconfig (arm, gcc-10) — PASS, 0 errors, 0 warnings, 0 section mismatches -------------------------------------------------------------------------------- bcm47xx_defconfig (mips, gcc-10) — PASS, 0 errors, 0 warnings, 0 section mismatches -------------------------------------------------------------------------------- bcm63xx_defconfig (mips, gcc-10) — PASS, 0 errors, 0 warnings, 0 section mismatches -------------------------------------------------------------------------------- bigsur_defconfig (mips, gcc-10) — PASS, 0 errors, 0 warnings, 0 section mismatches -------------------------------------------------------------------------------- bmips_be_defconfig (mips, gcc-10) — PASS, 0 errors, 0 warnings, 0 section mismatches -------------------------------------------------------------------------------- bmips_stb_defconfig (mips, gcc-10) — PASS, 0 errors, 0 warnings, 0 section mismatches -------------------------------------------------------------------------------- capcella_defconfig (mips, gcc-10) — PASS, 0 errors, 0 warnings, 0 section mismatches -------------------------------------------------------------------------------- cavium_octeon_defconfig (mips, gcc-10) — PASS, 0 errors, 0 warnings, 0 section mismatches -------------------------------------------------------------------------------- cerfcube_defconfig (arm, gcc-10) — PASS, 0 errors, 0 warnings, 0 section mismatches -------------------------------------------------------------------------------- ci20_defconfig (mips, gcc-10) — PASS, 0 errors, 0 warnings, 0 section mismatches -------------------------------------------------------------------------------- cm_x2xx_defconfig (arm, gcc-10) — PASS, 0 errors, 0 warnings, 0 section mismatches -------------------------------------------------------------------------------- cm_x300_defconfig (arm, gcc-10) — PASS, 0 errors, 0 warnings, 0 section mismatches -------------------------------------------------------------------------------- cobalt_defconfig (mips, gcc-10) — PASS, 0 errors, 0 warnings, 0 section mismatches -------------------------------------------------------------------------------- colibri_pxa270_defconfig (arm, gcc-10) — PASS, 0 errors, 0 warnings, 0 section mismatches -------------------------------------------------------------------------------- colibri_pxa300_defconfig (arm, gcc-10) — PASS, 0 errors, 0 warnings, 0 section mismatches -------------------------------------------------------------------------------- collie_defconfig (arm, gcc-10) — PASS, 0 errors, 0 warnings, 0 section mismatches -------------------------------------------------------------------------------- corgi_defconfig (arm, gcc-10) — PASS, 0 errors, 0 warnings, 0 section mismatches -------------------------------------------------------------------------------- davinci_all_defconfig (arm, gcc-10) — PASS, 0 errors, 0 warnings, 0 section mismatches -------------------------------------------------------------------------------- db1xxx_defconfig (mips, gcc-10) — PASS, 0 errors, 0 warnings, 0 section mismatches -------------------------------------------------------------------------------- decstation_defconfig (mips, gcc-10) — PASS, 0 errors, 0 warnings, 0 section mismatches -------------------------------------------------------------------------------- defconfig (arm64, gcc-10) — PASS, 0 errors, 0 warnings, 0 section mismatches Section mismatches: WARNING: modpost: Found 1 section mismatch(es). -------------------------------------------------------------------------------- defconfig+arm64-chromebook (arm64, gcc-10) — PASS, 0 errors, 0 warnings, 0 section mismatches Section mismatches: WARNING: modpost: Found 1 section mismatch(es). -------------------------------------------------------------------------------- dove_defconfig (arm, gcc-10) — PASS, 0 errors, 0 warnings, 0 section mismatches -------------------------------------------------------------------------------- e55_defconfig (mips, gcc-10) — PASS, 0 errors, 0 warnings, 0 section mismatches -------------------------------------------------------------------------------- ebsa110_defconfig (arm, gcc-10) — PASS, 0 errors, 0 warnings, 0 section mismatches -------------------------------------------------------------------------------- efm32_defconfig (arm, gcc-10) — PASS, 0 errors, 0 warnings, 0 section mismatches -------------------------------------------------------------------------------- em_x270_defconfig (arm, gcc-10) — PASS, 0 errors, 0 warnings, 0 section mismatches -------------------------------------------------------------------------------- ep93xx_defconfig (arm, gcc-10) — PASS, 0 errors, 0 warnings, 0 section mismatches Section mismatches: WARNING: modpost: Found 1 section mismatch(es). -------------------------------------------------------------------------------- eseries_pxa_defconfig (arm, gcc-10) — PASS, 0 errors, 0 warnings, 0 section mismatches -------------------------------------------------------------------------------- exynos_defconfig (arm, gcc-10) — PASS, 0 errors, 0 warnings, 0 section mismatches -------------------------------------------------------------------------------- ezx_defconfig (arm, gcc-10) — PASS, 0 errors, 0 warnings, 0 section mismatches -------------------------------------------------------------------------------- footbridge_defconfig (arm, gcc-10) — PASS, 0 errors, 0 warnings, 0 section mismatches -------------------------------------------------------------------------------- fuloong2e_defconfig (mips, gcc-10) — PASS, 0 errors, 0 warnings, 0 section mismatches -------------------------------------------------------------------------------- gemini_defconfig (arm, gcc-10) — PASS, 0 errors, 0 warnings, 0 section mismatches -------------------------------------------------------------------------------- gpr_defconfig (mips, gcc-10) — PASS, 0 errors, 0 warnings, 0 section mismatches -------------------------------------------------------------------------------- h3600_defconfig (arm, gcc-10) — PASS, 0 errors, 0 warnings, 0 section mismatches -------------------------------------------------------------------------------- h5000_defconfig (arm, gcc-10) — PASS, 0 errors, 0 warnings, 0 section mismatches -------------------------------------------------------------------------------- hackkit_defconfig (arm, gcc-10) — PASS, 0 errors, 0 warnings, 0 section mismatches -------------------------------------------------------------------------------- haps_hs_defconfig (arc, gcc-10) — PASS, 0 errors, 0 warnings, 0 section mismatches -------------------------------------------------------------------------------- haps_hs_smp_defconfig (arc, gcc-10) — PASS, 0 errors, 0 warnings, 0 section mismatches -------------------------------------------------------------------------------- hisi_defconfig (arm, gcc-10) — PASS, 0 errors, 0 warnings, 0 section mismatches -------------------------------------------------------------------------------- hsdk_defconfig (arc, gcc-10) — PASS, 0 errors, 0 warnings, 0 section mismatches -------------------------------------------------------------------------------- i386_defconfig (i386, gcc-10) — PASS, 0 errors, 3 warnings, 0 section mismatches Warnings: arch/x86/entry/entry_32.S:480: Warning: no instruction mnemonic suffix given and no register operands; using default for `btr' ld: arch/x86/boot/compressed/head_32.o: warning: relocation in read-only section `.head.text' ld: warning: creating DT_TEXTREL in a PIE -------------------------------------------------------------------------------- imote2_defconfig (arm, gcc-10) — PASS, 0 errors, 0 warnings, 0 section mismatches -------------------------------------------------------------------------------- imx_v4_v5_defconfig (arm, gcc-10) — PASS, 0 errors, 0 warnings, 0 section mismatches -------------------------------------------------------------------------------- imx_v6_v7_defconfig (arm, gcc-10) — PASS, 0 errors, 0 warnings, 0 section mismatches -------------------------------------------------------------------------------- integrator_defconfig (arm, gcc-10) — PASS, 0 errors, 0 warnings, 0 section mismatches Section mismatches: WARNING: modpost: Found 1 section mismatch(es). -------------------------------------------------------------------------------- iop13xx_defconfig (arm, gcc-10) — PASS, 0 errors, 0 warnings, 0 section mismatches -------------------------------------------------------------------------------- iop32x_defconfig (arm, gcc-10) — PASS, 0 errors, 0 warnings, 0 section mismatches -------------------------------------------------------------------------------- iop33x_defconfig (arm, gcc-10) — PASS, 0 errors, 0 warnings, 0 section mismatches -------------------------------------------------------------------------------- ip22_defconfig (mips, gcc-10) — PASS, 0 errors, 0 warnings, 0 section mismatches -------------------------------------------------------------------------------- ip27_defconfig (mips, gcc-10) — FAIL, 0 errors, 0 warnings, 0 section mismatches -------------------------------------------------------------------------------- ip28_defconfig (mips, gcc-10) — FAIL, 0 errors, 0 warnings, 0 section mismatches -------------------------------------------------------------------------------- ip32_defconfig (mips, gcc-10) — PASS, 0 errors, 0 warnings, 0 section mismatches -------------------------------------------------------------------------------- ixp4xx_defconfig (arm, gcc-10) — PASS, 0 errors, 0 warnings, 0 section mismatches -------------------------------------------------------------------------------- jazz_defconfig (mips, gcc-10) — PASS, 0 errors, 0 warnings, 0 section mismatches -------------------------------------------------------------------------------- jmr3927_defconfig (mips, gcc-10) — PASS, 0 errors, 0 warnings, 0 section mismatches -------------------------------------------------------------------------------- jornada720_defconfig (arm, gcc-10) — PASS, 0 errors, 0 warnings, 0 section mismatches -------------------------------------------------------------------------------- keystone_defconfig (arm, gcc-10) — PASS, 0 errors, 0 warnings, 0 section mismatches -------------------------------------------------------------------------------- ks8695_defconfig (arm, gcc-10) — PASS, 0 errors, 0 warnings, 0 section mismatches -------------------------------------------------------------------------------- lart_defconfig (arm, gcc-10) — PASS, 0 errors, 0 warnings, 0 section mismatches -------------------------------------------------------------------------------- lasat_defconfig (mips, gcc-10) — PASS, 0 errors, 0 warnings, 0 section mismatches -------------------------------------------------------------------------------- lemote2f_defconfig (mips, gcc-10) — PASS, 0 errors, 0 warnings, 0 section mismatches -------------------------------------------------------------------------------- loongson1b_defconfig (mips, gcc-10) — PASS, 0 errors, 0 warnings, 0 section mismatches -------------------------------------------------------------------------------- loongson1c_defconfig (mips, gcc-10) — PASS, 0 errors, 0 warnings, 0 section mismatches -------------------------------------------------------------------------------- loongson3_defconfig (mips, gcc-10) — PASS, 0 errors, 0 warnings, 0 section mismatches -------------------------------------------------------------------------------- lpc18xx_defconfig (arm, gcc-10) — PASS, 0 errors, 0 warnings, 0 section mismatches -------------------------------------------------------------------------------- lpc32xx_defconfig (arm, gcc-10) — PASS, 0 errors, 0 warnings, 0 section mismatches -------------------------------------------------------------------------------- lpd270_defconfig (arm, gcc-10) — PASS, 0 errors, 0 warnings, 0 section mismatches -------------------------------------------------------------------------------- lubbock_defconfig (arm, gcc-10) — PASS, 0 errors, 0 warnings, 0 section mismatches -------------------------------------------------------------------------------- magician_defconfig (arm, gcc-10) — PASS, 0 errors, 0 warnings, 0 section mismatches -------------------------------------------------------------------------------- mainstone_defconfig (arm, gcc-10) — PASS, 0 errors, 0 warnings, 0 section mismatches -------------------------------------------------------------------------------- malta_defconfig (mips, gcc-10) — PASS, 0 errors, 0 warnings, 0 section mismatches -------------------------------------------------------------------------------- malta_kvm_defconfig (mips, gcc-10) — PASS, 0 errors, 0 warnings, 0 section mismatches -------------------------------------------------------------------------------- malta_kvm_guest_defconfig (mips, gcc-10) — PASS, 0 errors, 0 warnings, 0 section mismatches -------------------------------------------------------------------------------- malta_qemu_32r6_defconfig (mips, gcc-10) — PASS, 0 errors, 1 warning, 0 section mismatches Warnings: {standard input}:30: Warning: macro instruction expanded into multiple instructions -------------------------------------------------------------------------------- maltaaprp_defconfig (mips, gcc-10) — PASS, 0 errors, 0 warnings, 0 section mismatches -------------------------------------------------------------------------------- maltasmvp_defconfig (mips, gcc-10) — PASS, 0 errors, 0 warnings, 0 section mismatches -------------------------------------------------------------------------------- maltasmvp_eva_defconfig (mips, gcc-10) — PASS, 0 errors, 0 warnings, 0 section mismatches -------------------------------------------------------------------------------- maltaup_defconfig (mips, gcc-10) — PASS, 0 errors, 0 warnings, 0 section mismatches -------------------------------------------------------------------------------- maltaup_xpa_defconfig (mips, gcc-10) — PASS, 0 errors, 0 warnings, 0 section mismatches -------------------------------------------------------------------------------- markeins_defconfig (mips, gcc-10) — PASS, 0 errors, 0 warnings, 0 section mismatches -------------------------------------------------------------------------------- mini2440_defconfig (arm, gcc-10) — PASS, 0 errors, 1 warning, 0 section mismatches Warnings: drivers/tty/serial/samsung.c:1790:34: warning: array ‘s3c24xx_uart_dt_match’ assumed to have one element -------------------------------------------------------------------------------- mips_paravirt_defconfig (mips, gcc-10) — PASS, 0 errors, 0 warnings, 0 section mismatches -------------------------------------------------------------------------------- mmp2_defconfig (arm, gcc-10) — PASS, 0 errors, 0 warnings, 0 section mismatches -------------------------------------------------------------------------------- moxart_defconfig (arm, gcc-10) — PASS, 0 errors, 0 warnings, 0 section mismatches -------------------------------------------------------------------------------- mpc30x_defconfig (mips, gcc-10) — PASS, 0 errors, 0 warnings, 0 section mismatches -------------------------------------------------------------------------------- mps2_defconfig (arm, gcc-10) — PASS, 0 errors, 0 warnings, 0 section mismatches -------------------------------------------------------------------------------- msp71xx_defconfig (mips, gcc-10) — PASS, 0 errors, 0 warnings, 0 section mismatches -------------------------------------------------------------------------------- mtx1_defconfig (mips, gcc-10) — PASS, 0 errors, 3 warnings, 0 section mismatches Warnings: sound/pci/echoaudio/echoaudio_dsp.c:647:9: warning: iteration 1073741824 invokes undefined behavior [-Waggressive-loop-optimizations] sound/pci/echoaudio/echoaudio_dsp.c:658:9: warning: iteration 1073741824 invokes undefined behavior [-Waggressive-loop-optimizations] sound/pci/echoaudio/echoaudio_dsp.c:647:9: warning: iteration 1073741824 invokes undefined behavior [-Waggressive-loop-optimizations] -------------------------------------------------------------------------------- multi_v4t_defconfig (arm, gcc-10) — PASS, 0 errors, 0 warnings, 0 section mismatches -------------------------------------------------------------------------------- multi_v5_defconfig (arm, gcc-10) — PASS, 0 errors, 0 warnings, 0 section mismatches Section mismatches: WARNING: modpost: Found 1 section mismatch(es). -------------------------------------------------------------------------------- multi_v7_defconfig (arm, gcc-10) — PASS, 0 errors, 0 warnings, 0 section mismatches -------------------------------------------------------------------------------- mvebu_v5_defconfig (arm, gcc-10) — PASS, 0 errors, 0 warnings, 0 section mismatches -------------------------------------------------------------------------------- mvebu_v7_defconfig (arm, gcc-10) — PASS, 0 errors, 0 warnings, 0 section mismatches -------------------------------------------------------------------------------- mxs_defconfig (arm, gcc-10) — PASS, 0 errors, 0 warnings, 0 section mismatches -------------------------------------------------------------------------------- neponset_defconfig (arm, gcc-10) — PASS, 0 errors, 0 warnings, 0 section mismatches -------------------------------------------------------------------------------- netwinder_defconfig (arm, gcc-10) — PASS, 0 errors, 0 warnings, 0 section mismatches -------------------------------------------------------------------------------- netx_defconfig (arm, gcc-10) — PASS, 0 errors, 0 warnings, 0 section mismatches Section mismatches: WARNING: modpost: Found 1 section mismatch(es). -------------------------------------------------------------------------------- nhk8815_defconfig (arm, gcc-10) — PASS, 0 errors, 0 warnings, 0 section mismatches Section mismatches: WARNING: modpost: Found 1 section mismatch(es). -------------------------------------------------------------------------------- nlm_xlp_defconfig (mips, gcc-10) — PASS, 0 errors, 0 warnings, 0 section mismatches -------------------------------------------------------------------------------- nlm_xlr_defconfig (mips, gcc-10) — PASS, 0 errors, 0 warnings, 0 section mismatches -------------------------------------------------------------------------------- nsim_hs_defconfig (arc, gcc-10) — PASS, 0 errors, 0 warnings, 0 section mismatches -------------------------------------------------------------------------------- nsim_hs_smp_defconfig (arc, gcc-10) — PASS, 0 errors, 0 warnings, 0 section mismatches -------------------------------------------------------------------------------- nsimosci_hs_defconfig (arc, gcc-10) — PASS, 0 errors, 0 warnings, 0 section mismatches -------------------------------------------------------------------------------- nsimosci_hs_smp_defconfig (arc, gcc-10) — PASS, 0 errors, 0 warnings, 0 section mismatches -------------------------------------------------------------------------------- nuc910_defconfig (arm, gcc-10) — PASS, 0 errors, 0 warnings, 0 section mismatches -------------------------------------------------------------------------------- nuc950_defconfig (arm, gcc-10) — PASS, 0 errors, 0 warnings, 0 section mismatches -------------------------------------------------------------------------------- nuc960_defconfig (arm, gcc-10) — PASS, 0 errors, 0 warnings, 0 section mismatches -------------------------------------------------------------------------------- omap1_defconfig (arm, gcc-10) — PASS, 0 errors, 1 warning, 0 section mismatches Warnings: drivers/gpio/gpio-omap.c:1152:34: warning: array ‘omap_gpio_match’ assumed to have one element -------------------------------------------------------------------------------- omap2plus_defconfig (arm, gcc-10) — PASS, 0 errors, 0 warnings, 0 section mismatches -------------------------------------------------------------------------------- omega2p_defconfig (mips, gcc-10) — PASS, 0 errors, 0 warnings, 0 section mismatches -------------------------------------------------------------------------------- orion5x_defconfig (arm, gcc-10) — PASS, 0 errors, 0 warnings, 0 section mismatches -------------------------------------------------------------------------------- palmz72_defconfig (arm, gcc-10) — PASS, 0 errors, 0 warnings, 0 section mismatches -------------------------------------------------------------------------------- pcm027_defconfig (arm, gcc-10) — PASS, 0 errors, 0 warnings, 0 section mismatches -------------------------------------------------------------------------------- pic32mzda_defconfig (mips, gcc-10) — PASS, 0 errors, 0 warnings, 0 section mismatches -------------------------------------------------------------------------------- pistachio_defconfig (mips, gcc-10) — PASS, 0 errors, 0 warnings, 0 section mismatches -------------------------------------------------------------------------------- pleb_defconfig (arm, gcc-10) — PASS, 0 errors, 0 warnings, 0 section mismatches -------------------------------------------------------------------------------- pnx8335_stb225_defconfig (mips, gcc-10) — PASS, 0 errors, 0 warnings, 0 section mismatches -------------------------------------------------------------------------------- prima2_defconfig (arm, gcc-10) — PASS, 0 errors, 0 warnings, 0 section mismatches -------------------------------------------------------------------------------- pxa168_defconfig (arm, gcc-10) — PASS, 0 errors, 0 warnings, 0 section mismatches -------------------------------------------------------------------------------- pxa255-idp_defconfig (arm, gcc-10) — PASS, 0 errors, 0 warnings, 0 section mismatches -------------------------------------------------------------------------------- pxa3xx_defconfig (arm, gcc-10) — PASS, 0 errors, 0 warnings, 0 section mismatches -------------------------------------------------------------------------------- pxa910_defconfig (arm, gcc-10) — PASS, 0 errors, 0 warnings, 0 section mismatches -------------------------------------------------------------------------------- pxa_defconfig (arm, gcc-10) — PASS, 0 errors, 0 warnings, 0 section mismatches -------------------------------------------------------------------------------- qcom_defconfig (arm, gcc-10) — PASS, 0 errors, 0 warnings, 0 section mismatches -------------------------------------------------------------------------------- qi_lb60_defconfig (mips, gcc-10) — PASS, 0 errors, 0 warnings, 0 section mismatches -------------------------------------------------------------------------------- raumfeld_defconfig (arm, gcc-10) — PASS, 0 errors, 0 warnings, 0 section mismatches -------------------------------------------------------------------------------- rb532_defconfig (mips, gcc-10) — PASS, 0 errors, 0 warnings, 0 section mismatches -------------------------------------------------------------------------------- rbtx49xx_defconfig (mips, gcc-10) — PASS, 0 errors, 0 warnings, 0 section mismatches -------------------------------------------------------------------------------- realview_defconfig (arm, gcc-10) — PASS, 0 errors, 0 warnings, 0 section mismatches -------------------------------------------------------------------------------- rm200_defconfig (mips, gcc-10) — PASS, 0 errors, 0 warnings, 0 section mismatches -------------------------------------------------------------------------------- rt305x_defconfig (mips, gcc-10) — PASS, 0 errors, 0 warnings, 0 section mismatches -------------------------------------------------------------------------------- s3c2410_defconfig (arm, gcc-10) — PASS, 0 errors, 1 warning, 0 section mismatches Warnings: drivers/tty/serial/samsung.c:1790:34: warning: array ‘s3c24xx_uart_dt_match’ assumed to have one element -------------------------------------------------------------------------------- s3c6400_defconfig (arm, gcc-10) — PASS, 0 errors, 0 warnings, 0 section mismatches Section mismatches: WARNING: modpost: Found 1 section mismatch(es). -------------------------------------------------------------------------------- s5pv210_defconfig (arm, gcc-10) — PASS, 0 errors, 0 warnings, 0 section mismatches Section mismatches: WARNING: modpost: Found 1 section mismatch(es). -------------------------------------------------------------------------------- sama5_defconfig (arm, gcc-10) — PASS, 0 errors, 0 warnings, 0 section mismatches -------------------------------------------------------------------------------- sb1250_swarm_defconfig (mips, gcc-10) — PASS, 0 errors, 0 warnings, 0 section mismatches -------------------------------------------------------------------------------- shannon_defconfig (arm, gcc-10) — PASS, 0 errors, 0 warnings, 0 section mismatches -------------------------------------------------------------------------------- shmobile_defconfig (arm, gcc-10) — PASS, 0 errors, 0 warnings, 0 section mismatches -------------------------------------------------------------------------------- simpad_defconfig (arm, gcc-10) — PASS, 0 errors, 0 warnings, 0 section mismatches -------------------------------------------------------------------------------- socfpga_defconfig (arm, gcc-10) — PASS, 0 errors, 0 warnings, 0 section mismatches -------------------------------------------------------------------------------- spear13xx_defconfig (arm, gcc-10) — PASS, 0 errors, 0 warnings, 0 section mismatches -------------------------------------------------------------------------------- spear3xx_defconfig (arm, gcc-10) — PASS, 0 errors, 0 warnings, 0 section mismatches Section mismatches: WARNING: modpost: Found 1 section mismatch(es). -------------------------------------------------------------------------------- spear6xx_defconfig (arm, gcc-10) — PASS, 0 errors, 0 warnings, 0 section mismatches Section mismatches: WARNING: modpost: Found 1 section mismatch(es). -------------------------------------------------------------------------------- spitz_defconfig (arm, gcc-10) — PASS, 0 errors, 0 warnings, 0 section mismatches -------------------------------------------------------------------------------- stm32_defconfig (arm, gcc-10) — PASS, 0 errors, 0 warnings, 0 section mismatches -------------------------------------------------------------------------------- sunxi_defconfig (arm, gcc-10) — PASS, 0 errors, 0 warnings, 0 section mismatches -------------------------------------------------------------------------------- tango4_defconfig (arm, gcc-10) — PASS, 0 errors, 0 warnings, 0 section mismatches -------------------------------------------------------------------------------- tb0219_defconfig (mips, gcc-10) — PASS, 0 errors, 0 warnings, 0 section mismatches -------------------------------------------------------------------------------- tb0226_defconfig (mips, gcc-10) — PASS, 0 errors, 0 warnings, 0 section mismatches -------------------------------------------------------------------------------- tb0287_defconfig (mips, gcc-10) — PASS, 0 errors, 0 warnings, 0 section mismatches -------------------------------------------------------------------------------- tct_hammer_defconfig (arm, gcc-10) — PASS, 0 errors, 0 warnings, 0 section mismatches -------------------------------------------------------------------------------- tegra_defconfig (arm, gcc-10) — PASS, 0 errors, 0 warnings, 0 section mismatches -------------------------------------------------------------------------------- tinyconfig (x86_64, gcc-10) — PASS, 0 errors, 3 warnings, 0 section mismatches Warnings: Warning: synced file at 'tools/objtool/arch/x86/include/asm/insn.h' differs from latest kernel version at 'arch/x86/include/asm/insn.h' ld: arch/x86/boot/compressed/head_64.o: warning: relocation in read-only section `.head.text' ld: warning: creating DT_TEXTREL in a PIE -------------------------------------------------------------------------------- tinyconfig (i386, gcc-10) — PASS, 0 errors, 3 warnings, 0 section mismatches Warnings: arch/x86/entry/entry_32.S:480: Warning: no instruction mnemonic suffix given and no register operands; using default for `btr' ld: arch/x86/boot/compressed/head_32.o: warning: relocation in read-only section `.head.text' ld: warning: creating DT_TEXTREL in a PIE -------------------------------------------------------------------------------- tinyconfig (arc, gcc-10) — PASS, 0 errors, 0 warnings, 0 section mismatches -------------------------------------------------------------------------------- tinyconfig (mips, gcc-10) — PASS, 0 errors, 0 warnings, 0 section mismatches -------------------------------------------------------------------------------- trizeps4_defconfig (arm, gcc-10) — PASS, 0 errors, 0 warnings, 0 section mismatches -------------------------------------------------------------------------------- u300_defconfig (arm, gcc-10) — PASS, 0 errors, 0 warnings, 0 section mismatches Section mismatches: WARNING: modpost: Found 1 section mismatch(es). -------------------------------------------------------------------------------- u8500_defconfig (arm, gcc-10) — PASS, 0 errors, 0 warnings, 0 section mismatches -------------------------------------------------------------------------------- vdk_hs38_defconfig (arc, gcc-10) — PASS, 0 errors, 0 warnings, 0 section mismatches -------------------------------------------------------------------------------- vdk_hs38_smp_defconfig (arc, gcc-10) — PASS, 0 errors, 0 warnings, 0 section mismatches -------------------------------------------------------------------------------- versatile_defconfig (arm, gcc-10) — PASS, 0 errors, 0 warnings, 0 section mismatches Section mismatches: WARNING: modpost: Found 1 section mismatch(es). -------------------------------------------------------------------------------- vexpress_defconfig (arm, gcc-10) — PASS, 0 errors, 0 warnings, 0 section mismatches -------------------------------------------------------------------------------- viper_defconfig (arm, gcc-10) — PASS, 0 errors, 0 warnings, 0 section mismatches -------------------------------------------------------------------------------- vocore2_defconfig (mips, gcc-10) — PASS, 0 errors, 0 warnings, 0 section mismatches -------------------------------------------------------------------------------- vt8500_v6_v7_defconfig (arm, gcc-10) — PASS, 0 errors, 0 warnings, 0 section mismatches -------------------------------------------------------------------------------- workpad_defconfig (mips, gcc-10) — PASS, 0 errors, 0 warnings, 0 section mismatches -------------------------------------------------------------------------------- x86_64_defconfig (x86_64, gcc-10) — PASS, 0 errors, 3 warnings, 0 section mismatches Warnings: Warning: synced file at 'tools/objtool/arch/x86/include/asm/insn.h' differs from latest kernel version at 'arch/x86/include/asm/insn.h' ld: arch/x86/boot/compressed/head_64.o: warning: relocation in read-only section `.head.text' ld: warning: creating DT_TEXTREL in a PIE -------------------------------------------------------------------------------- x86_64_defconfig+x86-chromebook (x86_64, gcc-10) — PASS, 0 errors, 3 warnings, 0 section mismatches Warnings: Warning: synced file at 'tools/objtool/arch/x86/include/asm/insn.h' differs from latest kernel version at 'arch/x86/include/asm/insn.h' ld: arch/x86/boot/compressed/head_64.o: warning: relocation in read-only section `.head.text' ld: warning: creating DT_TEXTREL in a PIE -------------------------------------------------------------------------------- xcep_defconfig (arm, gcc-10) — PASS, 0 errors, 0 warnings, 0 section mismatches -------------------------------------------------------------------------------- xilfpga_defconfig (mips, gcc-10) — PASS, 0 errors, 0 warnings, 0 section mismatches -------------------------------------------------------------------------------- zeus_defconfig (arm, gcc-10) — PASS, 0 errors, 0 warnings, 0 section mismatches -------------------------------------------------------------------------------- zx_defconfig (arm, gcc-10) — PASS, 0 errors, 0 warnings, 0 section mismatches --- For more info write to <info(a)kernelci.org>
1 year, 11 months
1
0
0
0
stable-rc/queue/5.15 build: 179 builds: 3 failed, 176 passed, 10 errors, 5 warnings (v5.15.103-72-ga6fd6a418659)
by kernelci.org bot
stable-rc/queue/5.15 build: 179 builds: 3 failed, 176 passed, 10 errors, 5 warnings (v5.15.103-72-ga6fd6a418659) Full Build Summary:
https://kernelci.org/build/stable-rc/branch/queue%2F5.15/kernel/v5.15.103-7…
Tree: stable-rc Branch: queue/5.15 Git Describe: v5.15.103-72-ga6fd6a418659 Git Commit: a6fd6a41865928f824c6c70cc89d3d5d858e6795 Git URL:
https://git.kernel.org/pub/scm/linux/kernel/git/stable/linux-stable-rc.git
Built: 7 unique architectures Build Failures Detected: mips: decstation_64_defconfig: (gcc-10) FAIL ip27_defconfig: (gcc-10) FAIL ip28_defconfig: (gcc-10) FAIL Errors and Warnings Detected: arc: tinyconfig (gcc-10): 1 warning arm64: arm: i386: mips: 32r2el_defconfig (gcc-10): 1 warning bigsur_defconfig (gcc-10): 1 error cavium_octeon_defconfig (gcc-10): 1 error decstation_64_defconfig (gcc-10): 1 error fuloong2e_defconfig (gcc-10): 1 error ip32_defconfig (gcc-10): 1 error lemote2f_defconfig (gcc-10): 1 error loongson2k_defconfig (gcc-10): 1 error loongson3_defconfig (gcc-10): 1 error nlm_xlp_defconfig (gcc-10): 1 error rm200_defconfig (gcc-10): 1 warning sb1250_swarm_defconfig (gcc-10): 1 error riscv: x86_64: x86_64_defconfig (gcc-10): 1 warning x86_64_defconfig+x86-chromebook (gcc-10): 1 warning Errors summary: 10 expr: syntax error: unexpected argument ‘0xffffffff80000000’ Warnings summary: 2 arch/x86/kernel/smp.o: warning: objtool: sysvec_reboot()+0x45: unreachable instruction 1 drivers/block/paride/bpck.c:32: warning: "PC" redefined 1 arch/mips/boot/dts/img/boston.dts:128.19-178.5: Warning (pci_device_reg): /pci@14000000/pci2_root@0,0,0: PCI unit address format error, expected "0,0" 1 arch/arc/Makefile:26: ** WARNING ** CONFIG_ARC_TUNE_MCPU flag '' is unknown, fallback to '' Section mismatches summary: 1 WARNING: modpost: vmlinux.o(___ksymtab_gpl+ixp4xx_irq_init+0x0): Section mismatch in reference from the variable __ksymtab_ixp4xx_irq_init to the function .init.text:ixp4xx_irq_init() 1 WARNING: modpost: vmlinux.o(___ksymtab+prom_init_numa_memory+0x0): Section mismatch in reference from the variable __ksymtab_prom_init_numa_memory to the function .init.text:prom_init_numa_memory() ================================================================================ Detailed per-defconfig build reports: -------------------------------------------------------------------------------- 32r2el_defconfig (mips, gcc-10) — PASS, 0 errors, 1 warning, 0 section mismatches Warnings: arch/mips/boot/dts/img/boston.dts:128.19-178.5: Warning (pci_device_reg): /pci@14000000/pci2_root@0,0,0: PCI unit address format error, expected "0,0" -------------------------------------------------------------------------------- allnoconfig (x86_64, gcc-10) — PASS, 0 errors, 0 warnings, 0 section mismatches -------------------------------------------------------------------------------- allnoconfig (arc, gcc-10) — PASS, 0 errors, 0 warnings, 0 section mismatches -------------------------------------------------------------------------------- allnoconfig (i386, gcc-10) — PASS, 0 errors, 0 warnings, 0 section mismatches -------------------------------------------------------------------------------- am200epdkit_defconfig (arm, gcc-10) — PASS, 0 errors, 0 warnings, 0 section mismatches -------------------------------------------------------------------------------- ar7_defconfig (mips, gcc-10) — PASS, 0 errors, 0 warnings, 0 section mismatches -------------------------------------------------------------------------------- aspeed_g4_defconfig (arm, gcc-10) — PASS, 0 errors, 0 warnings, 0 section mismatches -------------------------------------------------------------------------------- aspeed_g5_defconfig (arm, gcc-10) — PASS, 0 errors, 0 warnings, 0 section mismatches -------------------------------------------------------------------------------- assabet_defconfig (arm, gcc-10) — PASS, 0 errors, 0 warnings, 0 section mismatches -------------------------------------------------------------------------------- at91_dt_defconfig (arm, gcc-10) — PASS, 0 errors, 0 warnings, 0 section mismatches -------------------------------------------------------------------------------- ath25_defconfig (mips, gcc-10) — PASS, 0 errors, 0 warnings, 0 section mismatches -------------------------------------------------------------------------------- ath79_defconfig (mips, gcc-10) — PASS, 0 errors, 0 warnings, 0 section mismatches -------------------------------------------------------------------------------- axm55xx_defconfig (arm, gcc-10) — PASS, 0 errors, 0 warnings, 0 section mismatches -------------------------------------------------------------------------------- axs103_defconfig (arc, gcc-10) — PASS, 0 errors, 0 warnings, 0 section mismatches -------------------------------------------------------------------------------- axs103_smp_defconfig (arc, gcc-10) — PASS, 0 errors, 0 warnings, 0 section mismatches -------------------------------------------------------------------------------- badge4_defconfig (arm, gcc-10) — PASS, 0 errors, 0 warnings, 0 section mismatches -------------------------------------------------------------------------------- bcm2835_defconfig (arm, gcc-10) — PASS, 0 errors, 0 warnings, 0 section mismatches -------------------------------------------------------------------------------- bcm47xx_defconfig (mips, gcc-10) — PASS, 0 errors, 0 warnings, 0 section mismatches -------------------------------------------------------------------------------- bcm63xx_defconfig (mips, gcc-10) — PASS, 0 errors, 0 warnings, 0 section mismatches -------------------------------------------------------------------------------- bigsur_defconfig (mips, gcc-10) — PASS, 1 error, 0 warnings, 0 section mismatches Errors: expr: syntax error: unexpected argument ‘0xffffffff80000000’ -------------------------------------------------------------------------------- bmips_be_defconfig (mips, gcc-10) — PASS, 0 errors, 0 warnings, 0 section mismatches -------------------------------------------------------------------------------- bmips_stb_defconfig (mips, gcc-10) — PASS, 0 errors, 0 warnings, 0 section mismatches -------------------------------------------------------------------------------- capcella_defconfig (mips, gcc-10) — PASS, 0 errors, 0 warnings, 0 section mismatches -------------------------------------------------------------------------------- cavium_octeon_defconfig (mips, gcc-10) — PASS, 1 error, 0 warnings, 0 section mismatches Errors: expr: syntax error: unexpected argument ‘0xffffffff80000000’ -------------------------------------------------------------------------------- cerfcube_defconfig (arm, gcc-10) — PASS, 0 errors, 0 warnings, 0 section mismatches -------------------------------------------------------------------------------- ci20_defconfig (mips, gcc-10) — PASS, 0 errors, 0 warnings, 0 section mismatches -------------------------------------------------------------------------------- cm_x300_defconfig (arm, gcc-10) — PASS, 0 errors, 0 warnings, 0 section mismatches -------------------------------------------------------------------------------- cobalt_defconfig (mips, gcc-10) — PASS, 0 errors, 0 warnings, 0 section mismatches -------------------------------------------------------------------------------- colibri_pxa270_defconfig (arm, gcc-10) — PASS, 0 errors, 0 warnings, 0 section mismatches -------------------------------------------------------------------------------- colibri_pxa300_defconfig (arm, gcc-10) — PASS, 0 errors, 0 warnings, 0 section mismatches -------------------------------------------------------------------------------- collie_defconfig (arm, gcc-10) — PASS, 0 errors, 0 warnings, 0 section mismatches -------------------------------------------------------------------------------- corgi_defconfig (arm, gcc-10) — PASS, 0 errors, 0 warnings, 0 section mismatches -------------------------------------------------------------------------------- cu1000-neo_defconfig (mips, gcc-10) — PASS, 0 errors, 0 warnings, 0 section mismatches -------------------------------------------------------------------------------- cu1830-neo_defconfig (mips, gcc-10) — PASS, 0 errors, 0 warnings, 0 section mismatches -------------------------------------------------------------------------------- davinci_all_defconfig (arm, gcc-10) — PASS, 0 errors, 0 warnings, 0 section mismatches -------------------------------------------------------------------------------- db1xxx_defconfig (mips, gcc-10) — PASS, 0 errors, 0 warnings, 0 section mismatches -------------------------------------------------------------------------------- decstation_64_defconfig (mips, gcc-10) — FAIL, 1 error, 0 warnings, 0 section mismatches Errors: expr: syntax error: unexpected argument ‘0xffffffff80000000’ -------------------------------------------------------------------------------- decstation_defconfig (mips, gcc-10) — PASS, 0 errors, 0 warnings, 0 section mismatches -------------------------------------------------------------------------------- decstation_r4k_defconfig (mips, gcc-10) — PASS, 0 errors, 0 warnings, 0 section mismatches -------------------------------------------------------------------------------- defconfig (riscv, gcc-10) — PASS, 0 errors, 0 warnings, 0 section mismatches -------------------------------------------------------------------------------- defconfig (arm64, gcc-10) — PASS, 0 errors, 0 warnings, 0 section mismatches -------------------------------------------------------------------------------- defconfig+arm64-chromebook (arm64, gcc-10) — PASS, 0 errors, 0 warnings, 0 section mismatches -------------------------------------------------------------------------------- dove_defconfig (arm, gcc-10) — PASS, 0 errors, 0 warnings, 0 section mismatches -------------------------------------------------------------------------------- e55_defconfig (mips, gcc-10) — PASS, 0 errors, 0 warnings, 0 section mismatches -------------------------------------------------------------------------------- ep93xx_defconfig (arm, gcc-10) — PASS, 0 errors, 0 warnings, 0 section mismatches -------------------------------------------------------------------------------- eseries_pxa_defconfig (arm, gcc-10) — PASS, 0 errors, 0 warnings, 0 section mismatches -------------------------------------------------------------------------------- exynos_defconfig (arm, gcc-10) — PASS, 0 errors, 0 warnings, 0 section mismatches -------------------------------------------------------------------------------- ezx_defconfig (arm, gcc-10) — PASS, 0 errors, 0 warnings, 0 section mismatches -------------------------------------------------------------------------------- footbridge_defconfig (arm, gcc-10) — PASS, 0 errors, 0 warnings, 0 section mismatches -------------------------------------------------------------------------------- fuloong2e_defconfig (mips, gcc-10) — PASS, 1 error, 0 warnings, 0 section mismatches Errors: expr: syntax error: unexpected argument ‘0xffffffff80000000’ -------------------------------------------------------------------------------- gcw0_defconfig (mips, gcc-10) — PASS, 0 errors, 0 warnings, 0 section mismatches -------------------------------------------------------------------------------- gemini_defconfig (arm, gcc-10) — PASS, 0 errors, 0 warnings, 0 section mismatches -------------------------------------------------------------------------------- gpr_defconfig (mips, gcc-10) — PASS, 0 errors, 0 warnings, 0 section mismatches -------------------------------------------------------------------------------- h3600_defconfig (arm, gcc-10) — PASS, 0 errors, 0 warnings, 0 section mismatches -------------------------------------------------------------------------------- h5000_defconfig (arm, gcc-10) — PASS, 0 errors, 0 warnings, 0 section mismatches -------------------------------------------------------------------------------- hackkit_defconfig (arm, gcc-10) — PASS, 0 errors, 0 warnings, 0 section mismatches -------------------------------------------------------------------------------- haps_hs_defconfig (arc, gcc-10) — PASS, 0 errors, 0 warnings, 0 section mismatches -------------------------------------------------------------------------------- haps_hs_smp_defconfig (arc, gcc-10) — PASS, 0 errors, 0 warnings, 0 section mismatches -------------------------------------------------------------------------------- hisi_defconfig (arm, gcc-10) — PASS, 0 errors, 0 warnings, 0 section mismatches -------------------------------------------------------------------------------- hsdk_defconfig (arc, gcc-10) — PASS, 0 errors, 0 warnings, 0 section mismatches -------------------------------------------------------------------------------- i386_defconfig (i386, gcc-10) — PASS, 0 errors, 0 warnings, 0 section mismatches -------------------------------------------------------------------------------- imote2_defconfig (arm, gcc-10) — PASS, 0 errors, 0 warnings, 0 section mismatches -------------------------------------------------------------------------------- imx_v4_v5_defconfig (arm, gcc-10) — PASS, 0 errors, 0 warnings, 0 section mismatches -------------------------------------------------------------------------------- imx_v6_v7_defconfig (arm, gcc-10) — PASS, 0 errors, 0 warnings, 0 section mismatches -------------------------------------------------------------------------------- integrator_defconfig (arm, gcc-10) — PASS, 0 errors, 0 warnings, 0 section mismatches -------------------------------------------------------------------------------- iop32x_defconfig (arm, gcc-10) — PASS, 0 errors, 0 warnings, 0 section mismatches -------------------------------------------------------------------------------- ip22_defconfig (mips, gcc-10) — PASS, 0 errors, 0 warnings, 0 section mismatches -------------------------------------------------------------------------------- ip27_defconfig (mips, gcc-10) — FAIL, 0 errors, 0 warnings, 0 section mismatches -------------------------------------------------------------------------------- ip28_defconfig (mips, gcc-10) — FAIL, 0 errors, 0 warnings, 0 section mismatches -------------------------------------------------------------------------------- ip32_defconfig (mips, gcc-10) — PASS, 1 error, 0 warnings, 0 section mismatches Errors: expr: syntax error: unexpected argument ‘0xffffffff80000000’ -------------------------------------------------------------------------------- ixp4xx_defconfig (arm, gcc-10) — PASS, 0 errors, 0 warnings, 0 section mismatches Section mismatches: WARNING: modpost: vmlinux.o(___ksymtab_gpl+ixp4xx_irq_init+0x0): Section mismatch in reference from the variable __ksymtab_ixp4xx_irq_init to the function .init.text:ixp4xx_irq_init() -------------------------------------------------------------------------------- jazz_defconfig (mips, gcc-10) — PASS, 0 errors, 0 warnings, 0 section mismatches -------------------------------------------------------------------------------- jmr3927_defconfig (mips, gcc-10) — PASS, 0 errors, 0 warnings, 0 section mismatches -------------------------------------------------------------------------------- jornada720_defconfig (arm, gcc-10) — PASS, 0 errors, 0 warnings, 0 section mismatches -------------------------------------------------------------------------------- keystone_defconfig (arm, gcc-10) — PASS, 0 errors, 0 warnings, 0 section mismatches -------------------------------------------------------------------------------- lart_defconfig (arm, gcc-10) — PASS, 0 errors, 0 warnings, 0 section mismatches -------------------------------------------------------------------------------- lemote2f_defconfig (mips, gcc-10) — PASS, 1 error, 0 warnings, 0 section mismatches Errors: expr: syntax error: unexpected argument ‘0xffffffff80000000’ -------------------------------------------------------------------------------- loongson1b_defconfig (mips, gcc-10) — PASS, 0 errors, 0 warnings, 0 section mismatches -------------------------------------------------------------------------------- loongson1c_defconfig (mips, gcc-10) — PASS, 0 errors, 0 warnings, 0 section mismatches -------------------------------------------------------------------------------- loongson2k_defconfig (mips, gcc-10) — PASS, 1 error, 0 warnings, 0 section mismatches Errors: expr: syntax error: unexpected argument ‘0xffffffff80000000’ -------------------------------------------------------------------------------- loongson3_defconfig (mips, gcc-10) — PASS, 1 error, 0 warnings, 0 section mismatches Errors: expr: syntax error: unexpected argument ‘0xffffffff80000000’ Section mismatches: WARNING: modpost: vmlinux.o(___ksymtab+prom_init_numa_memory+0x0): Section mismatch in reference from the variable __ksymtab_prom_init_numa_memory to the function .init.text:prom_init_numa_memory() -------------------------------------------------------------------------------- lpc18xx_defconfig (arm, gcc-10) — PASS, 0 errors, 0 warnings, 0 section mismatches -------------------------------------------------------------------------------- lpc32xx_defconfig (arm, gcc-10) — PASS, 0 errors, 0 warnings, 0 section mismatches -------------------------------------------------------------------------------- lpd270_defconfig (arm, gcc-10) — PASS, 0 errors, 0 warnings, 0 section mismatches -------------------------------------------------------------------------------- lubbock_defconfig (arm, gcc-10) — PASS, 0 errors, 0 warnings, 0 section mismatches -------------------------------------------------------------------------------- magician_defconfig (arm, gcc-10) — PASS, 0 errors, 0 warnings, 0 section mismatches -------------------------------------------------------------------------------- mainstone_defconfig (arm, gcc-10) — PASS, 0 errors, 0 warnings, 0 section mismatches -------------------------------------------------------------------------------- malta_defconfig (mips, gcc-10) — PASS, 0 errors, 0 warnings, 0 section mismatches -------------------------------------------------------------------------------- malta_kvm_defconfig (mips, gcc-10) — PASS, 0 errors, 0 warnings, 0 section mismatches -------------------------------------------------------------------------------- malta_qemu_32r6_defconfig (mips, gcc-10) — PASS, 0 errors, 0 warnings, 0 section mismatches -------------------------------------------------------------------------------- maltaaprp_defconfig (mips, gcc-10) — PASS, 0 errors, 0 warnings, 0 section mismatches -------------------------------------------------------------------------------- maltasmvp_defconfig (mips, gcc-10) — PASS, 0 errors, 0 warnings, 0 section mismatches -------------------------------------------------------------------------------- maltasmvp_eva_defconfig (mips, gcc-10) — PASS, 0 errors, 0 warnings, 0 section mismatches -------------------------------------------------------------------------------- maltaup_defconfig (mips, gcc-10) — PASS, 0 errors, 0 warnings, 0 section mismatches -------------------------------------------------------------------------------- maltaup_xpa_defconfig (mips, gcc-10) — PASS, 0 errors, 0 warnings, 0 section mismatches -------------------------------------------------------------------------------- milbeaut_m10v_defconfig (arm, gcc-10) — PASS, 0 errors, 0 warnings, 0 section mismatches -------------------------------------------------------------------------------- mini2440_defconfig (arm, gcc-10) — PASS, 0 errors, 0 warnings, 0 section mismatches -------------------------------------------------------------------------------- mmp2_defconfig (arm, gcc-10) — PASS, 0 errors, 0 warnings, 0 section mismatches -------------------------------------------------------------------------------- moxart_defconfig (arm, gcc-10) — PASS, 0 errors, 0 warnings, 0 section mismatches -------------------------------------------------------------------------------- mpc30x_defconfig (mips, gcc-10) — PASS, 0 errors, 0 warnings, 0 section mismatches -------------------------------------------------------------------------------- mps2_defconfig (arm, gcc-10) — PASS, 0 errors, 0 warnings, 0 section mismatches -------------------------------------------------------------------------------- mtx1_defconfig (mips, gcc-10) — PASS, 0 errors, 0 warnings, 0 section mismatches -------------------------------------------------------------------------------- multi_v4t_defconfig (arm, gcc-10) — PASS, 0 errors, 0 warnings, 0 section mismatches -------------------------------------------------------------------------------- multi_v5_defconfig (arm, gcc-10) — PASS, 0 errors, 0 warnings, 0 section mismatches -------------------------------------------------------------------------------- multi_v7_defconfig (arm, gcc-10) — PASS, 0 errors, 0 warnings, 0 section mismatches -------------------------------------------------------------------------------- mvebu_v5_defconfig (arm, gcc-10) — PASS, 0 errors, 0 warnings, 0 section mismatches -------------------------------------------------------------------------------- mvebu_v7_defconfig (arm, gcc-10) — PASS, 0 errors, 0 warnings, 0 section mismatches -------------------------------------------------------------------------------- mxs_defconfig (arm, gcc-10) — PASS, 0 errors, 0 warnings, 0 section mismatches -------------------------------------------------------------------------------- neponset_defconfig (arm, gcc-10) — PASS, 0 errors, 0 warnings, 0 section mismatches -------------------------------------------------------------------------------- netwinder_defconfig (arm, gcc-10) — PASS, 0 errors, 0 warnings, 0 section mismatches -------------------------------------------------------------------------------- nhk8815_defconfig (arm, gcc-10) — PASS, 0 errors, 0 warnings, 0 section mismatches -------------------------------------------------------------------------------- nlm_xlp_defconfig (mips, gcc-10) — PASS, 1 error, 0 warnings, 0 section mismatches Errors: expr: syntax error: unexpected argument ‘0xffffffff80000000’ -------------------------------------------------------------------------------- nlm_xlr_defconfig (mips, gcc-10) — PASS, 0 errors, 0 warnings, 0 section mismatches -------------------------------------------------------------------------------- nommu_k210_defconfig (riscv, gcc-10) — PASS, 0 errors, 0 warnings, 0 section mismatches -------------------------------------------------------------------------------- nommu_k210_sdcard_defconfig (riscv, gcc-10) — PASS, 0 errors, 0 warnings, 0 section mismatches -------------------------------------------------------------------------------- nsimosci_hs_defconfig (arc, gcc-10) — PASS, 0 errors, 0 warnings, 0 section mismatches -------------------------------------------------------------------------------- nsimosci_hs_smp_defconfig (arc, gcc-10) — PASS, 0 errors, 0 warnings, 0 section mismatches -------------------------------------------------------------------------------- omap1_defconfig (arm, gcc-10) — PASS, 0 errors, 0 warnings, 0 section mismatches -------------------------------------------------------------------------------- omap2plus_defconfig (arm, gcc-10) — PASS, 0 errors, 0 warnings, 0 section mismatches -------------------------------------------------------------------------------- omega2p_defconfig (mips, gcc-10) — PASS, 0 errors, 0 warnings, 0 section mismatches -------------------------------------------------------------------------------- orion5x_defconfig (arm, gcc-10) — PASS, 0 errors, 0 warnings, 0 section mismatches -------------------------------------------------------------------------------- oxnas_v6_defconfig (arm, gcc-10) — PASS, 0 errors, 0 warnings, 0 section mismatches -------------------------------------------------------------------------------- palmz72_defconfig (arm, gcc-10) — PASS, 0 errors, 0 warnings, 0 section mismatches -------------------------------------------------------------------------------- pcm027_defconfig (arm, gcc-10) — PASS, 0 errors, 0 warnings, 0 section mismatches -------------------------------------------------------------------------------- pic32mzda_defconfig (mips, gcc-10) — PASS, 0 errors, 0 warnings, 0 section mismatches -------------------------------------------------------------------------------- pleb_defconfig (arm, gcc-10) — PASS, 0 errors, 0 warnings, 0 section mismatches -------------------------------------------------------------------------------- pxa168_defconfig (arm, gcc-10) — PASS, 0 errors, 0 warnings, 0 section mismatches -------------------------------------------------------------------------------- pxa255-idp_defconfig (arm, gcc-10) — PASS, 0 errors, 0 warnings, 0 section mismatches -------------------------------------------------------------------------------- pxa3xx_defconfig (arm, gcc-10) — PASS, 0 errors, 0 warnings, 0 section mismatches -------------------------------------------------------------------------------- pxa910_defconfig (arm, gcc-10) — PASS, 0 errors, 0 warnings, 0 section mismatches -------------------------------------------------------------------------------- pxa_defconfig (arm, gcc-10) — PASS, 0 errors, 0 warnings, 0 section mismatches -------------------------------------------------------------------------------- qcom_defconfig (arm, gcc-10) — PASS, 0 errors, 0 warnings, 0 section mismatches -------------------------------------------------------------------------------- qi_lb60_defconfig (mips, gcc-10) — PASS, 0 errors, 0 warnings, 0 section mismatches -------------------------------------------------------------------------------- rb532_defconfig (mips, gcc-10) — PASS, 0 errors, 0 warnings, 0 section mismatches -------------------------------------------------------------------------------- rbtx49xx_defconfig (mips, gcc-10) — PASS, 0 errors, 0 warnings, 0 section mismatches -------------------------------------------------------------------------------- realview_defconfig (arm, gcc-10) — PASS, 0 errors, 0 warnings, 0 section mismatches -------------------------------------------------------------------------------- rm200_defconfig (mips, gcc-10) — PASS, 0 errors, 1 warning, 0 section mismatches Warnings: drivers/block/paride/bpck.c:32: warning: "PC" redefined -------------------------------------------------------------------------------- rs90_defconfig (mips, gcc-10) — PASS, 0 errors, 0 warnings, 0 section mismatches -------------------------------------------------------------------------------- rt305x_defconfig (mips, gcc-10) — PASS, 0 errors, 0 warnings, 0 section mismatches -------------------------------------------------------------------------------- rv32_defconfig (riscv, gcc-10) — PASS, 0 errors, 0 warnings, 0 section mismatches -------------------------------------------------------------------------------- s3c2410_defconfig (arm, gcc-10) — PASS, 0 errors, 0 warnings, 0 section mismatches -------------------------------------------------------------------------------- s3c6400_defconfig (arm, gcc-10) — PASS, 0 errors, 0 warnings, 0 section mismatches -------------------------------------------------------------------------------- s5pv210_defconfig (arm, gcc-10) — PASS, 0 errors, 0 warnings, 0 section mismatches -------------------------------------------------------------------------------- sama5_defconfig (arm, gcc-10) — PASS, 0 errors, 0 warnings, 0 section mismatches -------------------------------------------------------------------------------- sama7_defconfig (arm, gcc-10) — PASS, 0 errors, 0 warnings, 0 section mismatches -------------------------------------------------------------------------------- sb1250_swarm_defconfig (mips, gcc-10) — PASS, 1 error, 0 warnings, 0 section mismatches Errors: expr: syntax error: unexpected argument ‘0xffffffff80000000’ -------------------------------------------------------------------------------- shannon_defconfig (arm, gcc-10) — PASS, 0 errors, 0 warnings, 0 section mismatches -------------------------------------------------------------------------------- shmobile_defconfig (arm, gcc-10) — PASS, 0 errors, 0 warnings, 0 section mismatches -------------------------------------------------------------------------------- simpad_defconfig (arm, gcc-10) — PASS, 0 errors, 0 warnings, 0 section mismatches -------------------------------------------------------------------------------- socfpga_defconfig (arm, gcc-10) — PASS, 0 errors, 0 warnings, 0 section mismatches -------------------------------------------------------------------------------- spear13xx_defconfig (arm, gcc-10) — PASS, 0 errors, 0 warnings, 0 section mismatches -------------------------------------------------------------------------------- spear3xx_defconfig (arm, gcc-10) — PASS, 0 errors, 0 warnings, 0 section mismatches -------------------------------------------------------------------------------- spear6xx_defconfig (arm, gcc-10) — PASS, 0 errors, 0 warnings, 0 section mismatches -------------------------------------------------------------------------------- spitz_defconfig (arm, gcc-10) — PASS, 0 errors, 0 warnings, 0 section mismatches -------------------------------------------------------------------------------- stm32_defconfig (arm, gcc-10) — PASS, 0 errors, 0 warnings, 0 section mismatches -------------------------------------------------------------------------------- sunxi_defconfig (arm, gcc-10) — PASS, 0 errors, 0 warnings, 0 section mismatches -------------------------------------------------------------------------------- tb0219_defconfig (mips, gcc-10) — PASS, 0 errors, 0 warnings, 0 section mismatches -------------------------------------------------------------------------------- tb0226_defconfig (mips, gcc-10) — PASS, 0 errors, 0 warnings, 0 section mismatches -------------------------------------------------------------------------------- tb0287_defconfig (mips, gcc-10) — PASS, 0 errors, 0 warnings, 0 section mismatches -------------------------------------------------------------------------------- tct_hammer_defconfig (arm, gcc-10) — PASS, 0 errors, 0 warnings, 0 section mismatches -------------------------------------------------------------------------------- tegra_defconfig (arm, gcc-10) — PASS, 0 errors, 0 warnings, 0 section mismatches -------------------------------------------------------------------------------- tinyconfig (arc, gcc-10) — PASS, 0 errors, 1 warning, 0 section mismatches Warnings: arch/arc/Makefile:26: ** WARNING ** CONFIG_ARC_TUNE_MCPU flag '' is unknown, fallback to '' -------------------------------------------------------------------------------- tinyconfig (i386, gcc-10) — PASS, 0 errors, 0 warnings, 0 section mismatches -------------------------------------------------------------------------------- tinyconfig (x86_64, gcc-10) — PASS, 0 errors, 0 warnings, 0 section mismatches -------------------------------------------------------------------------------- trizeps4_defconfig (arm, gcc-10) — PASS, 0 errors, 0 warnings, 0 section mismatches -------------------------------------------------------------------------------- u8500_defconfig (arm, gcc-10) — PASS, 0 errors, 0 warnings, 0 section mismatches -------------------------------------------------------------------------------- vdk_hs38_defconfig (arc, gcc-10) — PASS, 0 errors, 0 warnings, 0 section mismatches -------------------------------------------------------------------------------- vdk_hs38_smp_defconfig (arc, gcc-10) — PASS, 0 errors, 0 warnings, 0 section mismatches -------------------------------------------------------------------------------- versatile_defconfig (arm, gcc-10) — PASS, 0 errors, 0 warnings, 0 section mismatches -------------------------------------------------------------------------------- vexpress_defconfig (arm, gcc-10) — PASS, 0 errors, 0 warnings, 0 section mismatches -------------------------------------------------------------------------------- vf610m4_defconfig (arm, gcc-10) — PASS, 0 errors, 0 warnings, 0 section mismatches -------------------------------------------------------------------------------- viper_defconfig (arm, gcc-10) — PASS, 0 errors, 0 warnings, 0 section mismatches -------------------------------------------------------------------------------- vocore2_defconfig (mips, gcc-10) — PASS, 0 errors, 0 warnings, 0 section mismatches -------------------------------------------------------------------------------- vt8500_v6_v7_defconfig (arm, gcc-10) — PASS, 0 errors, 0 warnings, 0 section mismatches -------------------------------------------------------------------------------- workpad_defconfig (mips, gcc-10) — PASS, 0 errors, 0 warnings, 0 section mismatches -------------------------------------------------------------------------------- x86_64_defconfig (x86_64, gcc-10) — PASS, 0 errors, 1 warning, 0 section mismatches Warnings: arch/x86/kernel/smp.o: warning: objtool: sysvec_reboot()+0x45: unreachable instruction -------------------------------------------------------------------------------- x86_64_defconfig+x86-chromebook (x86_64, gcc-10) — PASS, 0 errors, 1 warning, 0 section mismatches Warnings: arch/x86/kernel/smp.o: warning: objtool: sysvec_reboot()+0x45: unreachable instruction -------------------------------------------------------------------------------- xcep_defconfig (arm, gcc-10) — PASS, 0 errors, 0 warnings, 0 section mismatches -------------------------------------------------------------------------------- zeus_defconfig (arm, gcc-10) — PASS, 0 errors, 0 warnings, 0 section mismatches --- For more info write to <info(a)kernelci.org>
1 year, 11 months
1
0
0
0
stable-rc/queue/5.4 build: 188 builds: 3 failed, 185 passed, 3 errors, 35 warnings (v5.4.237-43-g6da7388788d28)
by kernelci.org bot
stable-rc/queue/5.4 build: 188 builds: 3 failed, 185 passed, 3 errors, 35 warnings (v5.4.237-43-g6da7388788d28) Full Build Summary:
https://kernelci.org/build/stable-rc/branch/queue%2F5.4/kernel/v5.4.237-43-…
Tree: stable-rc Branch: queue/5.4 Git Describe: v5.4.237-43-g6da7388788d28 Git Commit: 6da7388788d282ce80c6cc93e7c9753f8050ac22 Git URL:
https://git.kernel.org/pub/scm/linux/kernel/git/stable/linux-stable-rc.git
Built: 7 unique architectures Build Failures Detected: mips: ip27_defconfig: (gcc-10) FAIL ip28_defconfig: (gcc-10) FAIL lasat_defconfig: (gcc-10) FAIL Errors and Warnings Detected: arc: arm64: defconfig (gcc-10): 2 warnings defconfig+arm64-chromebook (gcc-10): 2 warnings arm: assabet_defconfig (gcc-10): 1 warning collie_defconfig (gcc-10): 1 warning h3600_defconfig (gcc-10): 1 warning neponset_defconfig (gcc-10): 1 warning shannon_defconfig (gcc-10): 1 warning i386: allnoconfig (gcc-10): 2 warnings i386_defconfig (gcc-10): 2 warnings tinyconfig (gcc-10): 2 warnings mips: lasat_defconfig (gcc-10): 3 errors, 1 warning mtx1_defconfig (gcc-10): 3 warnings riscv: x86_64: allnoconfig (gcc-10): 4 warnings tinyconfig (gcc-10): 4 warnings x86_64_defconfig (gcc-10): 4 warnings x86_64_defconfig+x86-chromebook (gcc-10): 4 warnings Errors summary: 1 arch/mips/lasat/picvue_proc.c:87:20: error: ‘pvc_display_tasklet’ undeclared (first use in this function) 1 arch/mips/lasat/picvue_proc.c:42:44: error: expected ‘)’ before ‘&’ token 1 arch/mips/lasat/picvue_proc.c:33:13: error: ‘pvc_display’ defined but not used [-Werror=unused-function] Warnings summary: 7 ld: warning: creating DT_TEXTREL in a PIE 5 drivers/video/fbdev/sa1100fb.c:975:21: warning: ‘sa1100fb_min_dma_period’ defined but not used [-Wunused-function] 4 ld: arch/x86/boot/compressed/head_64.o: warning: relocation in read-only section `.head.text' 4 arch/arm64/include/asm/memory.h:238:15: warning: cast from pointer to integer of different size [-Wpointer-to-int-cast] 3 ld: arch/x86/boot/compressed/head_32.o: warning: relocation in read-only section `.head.text' 2 sound/pci/echoaudio/echoaudio_dsp.c:647:9: warning: iteration 1073741824 invokes undefined behavior [-Waggressive-loop-optimizations] 2 arch/x86/entry/entry_64.o: warning: objtool: If this is a retpoline, please patch it in with alternatives and annotate it with ANNOTATE_NOSPEC_ALTERNATIVE. 2 arch/x86/entry/entry_64.o: warning: objtool: .entry.text+0x1c1: unsupported intra-function call 2 arch/x86/entry/entry_64.o: warning: objtool: .entry.text+0x151: unsupported intra-function call 2 arch/x86/entry/entry_64.S:1756: Warning: no instruction mnemonic suffix given and no register operands; using default for `sysret' 1 sound/pci/echoaudio/echoaudio_dsp.c:658:9: warning: iteration 1073741824 invokes undefined behavior [-Waggressive-loop-optimizations] 1 cc1: all warnings being treated as errors Section mismatches summary: 10 WARNING: vmlinux.o(___ksymtab_gpl+vic_init_cascaded+0x0): Section mismatch in reference from the variable __ksymtab_vic_init_cascaded to the function .init.text:vic_init_cascaded() 1 WARNING: vmlinux.o(___ksymtab_gpl+ixp4xx_irq_init+0x0): Section mismatch in reference from the variable __ksymtab_ixp4xx_irq_init to the function .init.text:ixp4xx_irq_init() 1 WARNING: vmlinux.o(.text.unlikely+0x3a90): Section mismatch in reference from the function pmax_setup_memory_region() to the function .init.text:add_memory_region() ================================================================================ Detailed per-defconfig build reports: -------------------------------------------------------------------------------- 32r2el_defconfig (mips, gcc-10) — PASS, 0 errors, 0 warnings, 0 section mismatches -------------------------------------------------------------------------------- allnoconfig (arc, gcc-10) — PASS, 0 errors, 0 warnings, 0 section mismatches -------------------------------------------------------------------------------- allnoconfig (i386, gcc-10) — PASS, 0 errors, 2 warnings, 0 section mismatches Warnings: ld: arch/x86/boot/compressed/head_32.o: warning: relocation in read-only section `.head.text' ld: warning: creating DT_TEXTREL in a PIE -------------------------------------------------------------------------------- allnoconfig (x86_64, gcc-10) — PASS, 0 errors, 4 warnings, 0 section mismatches Warnings: arch/x86/entry/entry_64.S:1756: Warning: no instruction mnemonic suffix given and no register operands; using default for `sysret' arch/x86/entry/entry_64.o: warning: objtool: .entry.text+0x151: unsupported intra-function call ld: arch/x86/boot/compressed/head_64.o: warning: relocation in read-only section `.head.text' ld: warning: creating DT_TEXTREL in a PIE -------------------------------------------------------------------------------- am200epdkit_defconfig (arm, gcc-10) — PASS, 0 errors, 0 warnings, 0 section mismatches -------------------------------------------------------------------------------- ar7_defconfig (mips, gcc-10) — PASS, 0 errors, 0 warnings, 0 section mismatches -------------------------------------------------------------------------------- aspeed_g4_defconfig (arm, gcc-10) — PASS, 0 errors, 0 warnings, 0 section mismatches -------------------------------------------------------------------------------- aspeed_g5_defconfig (arm, gcc-10) — PASS, 0 errors, 0 warnings, 0 section mismatches -------------------------------------------------------------------------------- assabet_defconfig (arm, gcc-10) — PASS, 0 errors, 1 warning, 0 section mismatches Warnings: drivers/video/fbdev/sa1100fb.c:975:21: warning: ‘sa1100fb_min_dma_period’ defined but not used [-Wunused-function] -------------------------------------------------------------------------------- at91_dt_defconfig (arm, gcc-10) — PASS, 0 errors, 0 warnings, 0 section mismatches -------------------------------------------------------------------------------- ath25_defconfig (mips, gcc-10) — PASS, 0 errors, 0 warnings, 0 section mismatches -------------------------------------------------------------------------------- ath79_defconfig (mips, gcc-10) — PASS, 0 errors, 0 warnings, 0 section mismatches -------------------------------------------------------------------------------- axm55xx_defconfig (arm, gcc-10) — PASS, 0 errors, 0 warnings, 0 section mismatches -------------------------------------------------------------------------------- axs103_defconfig (arc, gcc-10) — PASS, 0 errors, 0 warnings, 0 section mismatches -------------------------------------------------------------------------------- axs103_smp_defconfig (arc, gcc-10) — PASS, 0 errors, 0 warnings, 0 section mismatches -------------------------------------------------------------------------------- badge4_defconfig (arm, gcc-10) — PASS, 0 errors, 0 warnings, 0 section mismatches -------------------------------------------------------------------------------- bcm2835_defconfig (arm, gcc-10) — PASS, 0 errors, 0 warnings, 0 section mismatches -------------------------------------------------------------------------------- bcm47xx_defconfig (mips, gcc-10) — PASS, 0 errors, 0 warnings, 0 section mismatches -------------------------------------------------------------------------------- bcm63xx_defconfig (mips, gcc-10) — PASS, 0 errors, 0 warnings, 0 section mismatches -------------------------------------------------------------------------------- bigsur_defconfig (mips, gcc-10) — PASS, 0 errors, 0 warnings, 0 section mismatches -------------------------------------------------------------------------------- bmips_be_defconfig (mips, gcc-10) — PASS, 0 errors, 0 warnings, 0 section mismatches -------------------------------------------------------------------------------- bmips_stb_defconfig (mips, gcc-10) — PASS, 0 errors, 0 warnings, 0 section mismatches -------------------------------------------------------------------------------- capcella_defconfig (mips, gcc-10) — PASS, 0 errors, 0 warnings, 0 section mismatches -------------------------------------------------------------------------------- cavium_octeon_defconfig (mips, gcc-10) — PASS, 0 errors, 0 warnings, 0 section mismatches -------------------------------------------------------------------------------- cerfcube_defconfig (arm, gcc-10) — PASS, 0 errors, 0 warnings, 0 section mismatches -------------------------------------------------------------------------------- ci20_defconfig (mips, gcc-10) — PASS, 0 errors, 0 warnings, 0 section mismatches -------------------------------------------------------------------------------- cm_x2xx_defconfig (arm, gcc-10) — PASS, 0 errors, 0 warnings, 0 section mismatches -------------------------------------------------------------------------------- cm_x300_defconfig (arm, gcc-10) — PASS, 0 errors, 0 warnings, 0 section mismatches -------------------------------------------------------------------------------- cobalt_defconfig (mips, gcc-10) — PASS, 0 errors, 0 warnings, 0 section mismatches -------------------------------------------------------------------------------- colibri_pxa270_defconfig (arm, gcc-10) — PASS, 0 errors, 0 warnings, 0 section mismatches -------------------------------------------------------------------------------- colibri_pxa300_defconfig (arm, gcc-10) — PASS, 0 errors, 0 warnings, 0 section mismatches -------------------------------------------------------------------------------- collie_defconfig (arm, gcc-10) — PASS, 0 errors, 1 warning, 0 section mismatches Warnings: drivers/video/fbdev/sa1100fb.c:975:21: warning: ‘sa1100fb_min_dma_period’ defined but not used [-Wunused-function] -------------------------------------------------------------------------------- corgi_defconfig (arm, gcc-10) — PASS, 0 errors, 0 warnings, 0 section mismatches -------------------------------------------------------------------------------- davinci_all_defconfig (arm, gcc-10) — PASS, 0 errors, 0 warnings, 0 section mismatches -------------------------------------------------------------------------------- db1xxx_defconfig (mips, gcc-10) — PASS, 0 errors, 0 warnings, 0 section mismatches -------------------------------------------------------------------------------- decstation_64_defconfig (mips, gcc-10) — PASS, 0 errors, 0 warnings, 0 section mismatches -------------------------------------------------------------------------------- decstation_defconfig (mips, gcc-10) — PASS, 0 errors, 0 warnings, 0 section mismatches Section mismatches: WARNING: vmlinux.o(.text.unlikely+0x3a90): Section mismatch in reference from the function pmax_setup_memory_region() to the function .init.text:add_memory_region() -------------------------------------------------------------------------------- decstation_r4k_defconfig (mips, gcc-10) — PASS, 0 errors, 0 warnings, 0 section mismatches -------------------------------------------------------------------------------- defconfig (riscv, gcc-10) — PASS, 0 errors, 0 warnings, 0 section mismatches -------------------------------------------------------------------------------- defconfig (arm64, gcc-10) — PASS, 0 errors, 2 warnings, 0 section mismatches Warnings: arch/arm64/include/asm/memory.h:238:15: warning: cast from pointer to integer of different size [-Wpointer-to-int-cast] arch/arm64/include/asm/memory.h:238:15: warning: cast from pointer to integer of different size [-Wpointer-to-int-cast] -------------------------------------------------------------------------------- defconfig+arm64-chromebook (arm64, gcc-10) — PASS, 0 errors, 2 warnings, 0 section mismatches Warnings: arch/arm64/include/asm/memory.h:238:15: warning: cast from pointer to integer of different size [-Wpointer-to-int-cast] arch/arm64/include/asm/memory.h:238:15: warning: cast from pointer to integer of different size [-Wpointer-to-int-cast] -------------------------------------------------------------------------------- dove_defconfig (arm, gcc-10) — PASS, 0 errors, 0 warnings, 0 section mismatches -------------------------------------------------------------------------------- e55_defconfig (mips, gcc-10) — PASS, 0 errors, 0 warnings, 0 section mismatches -------------------------------------------------------------------------------- ebsa110_defconfig (arm, gcc-10) — PASS, 0 errors, 0 warnings, 0 section mismatches -------------------------------------------------------------------------------- efm32_defconfig (arm, gcc-10) — PASS, 0 errors, 0 warnings, 0 section mismatches -------------------------------------------------------------------------------- em_x270_defconfig (arm, gcc-10) — PASS, 0 errors, 0 warnings, 0 section mismatches -------------------------------------------------------------------------------- ep93xx_defconfig (arm, gcc-10) — PASS, 0 errors, 0 warnings, 0 section mismatches Section mismatches: WARNING: vmlinux.o(___ksymtab_gpl+vic_init_cascaded+0x0): Section mismatch in reference from the variable __ksymtab_vic_init_cascaded to the function .init.text:vic_init_cascaded() -------------------------------------------------------------------------------- eseries_pxa_defconfig (arm, gcc-10) — PASS, 0 errors, 0 warnings, 0 section mismatches -------------------------------------------------------------------------------- exynos_defconfig (arm, gcc-10) — PASS, 0 errors, 0 warnings, 0 section mismatches -------------------------------------------------------------------------------- ezx_defconfig (arm, gcc-10) — PASS, 0 errors, 0 warnings, 0 section mismatches -------------------------------------------------------------------------------- footbridge_defconfig (arm, gcc-10) — PASS, 0 errors, 0 warnings, 0 section mismatches -------------------------------------------------------------------------------- fuloong2e_defconfig (mips, gcc-10) — PASS, 0 errors, 0 warnings, 0 section mismatches -------------------------------------------------------------------------------- gcw0_defconfig (mips, gcc-10) — PASS, 0 errors, 0 warnings, 0 section mismatches -------------------------------------------------------------------------------- gemini_defconfig (arm, gcc-10) — PASS, 0 errors, 0 warnings, 0 section mismatches -------------------------------------------------------------------------------- gpr_defconfig (mips, gcc-10) — PASS, 0 errors, 0 warnings, 0 section mismatches -------------------------------------------------------------------------------- h3600_defconfig (arm, gcc-10) — PASS, 0 errors, 1 warning, 0 section mismatches Warnings: drivers/video/fbdev/sa1100fb.c:975:21: warning: ‘sa1100fb_min_dma_period’ defined but not used [-Wunused-function] -------------------------------------------------------------------------------- h5000_defconfig (arm, gcc-10) — PASS, 0 errors, 0 warnings, 0 section mismatches -------------------------------------------------------------------------------- hackkit_defconfig (arm, gcc-10) — PASS, 0 errors, 0 warnings, 0 section mismatches -------------------------------------------------------------------------------- haps_hs_defconfig (arc, gcc-10) — PASS, 0 errors, 0 warnings, 0 section mismatches -------------------------------------------------------------------------------- haps_hs_smp_defconfig (arc, gcc-10) — PASS, 0 errors, 0 warnings, 0 section mismatches -------------------------------------------------------------------------------- hisi_defconfig (arm, gcc-10) — PASS, 0 errors, 0 warnings, 0 section mismatches -------------------------------------------------------------------------------- hsdk_defconfig (arc, gcc-10) — PASS, 0 errors, 0 warnings, 0 section mismatches -------------------------------------------------------------------------------- i386_defconfig (i386, gcc-10) — PASS, 0 errors, 2 warnings, 0 section mismatches Warnings: ld: arch/x86/boot/compressed/head_32.o: warning: relocation in read-only section `.head.text' ld: warning: creating DT_TEXTREL in a PIE -------------------------------------------------------------------------------- imote2_defconfig (arm, gcc-10) — PASS, 0 errors, 0 warnings, 0 section mismatches -------------------------------------------------------------------------------- imx_v4_v5_defconfig (arm, gcc-10) — PASS, 0 errors, 0 warnings, 0 section mismatches -------------------------------------------------------------------------------- imx_v6_v7_defconfig (arm, gcc-10) — PASS, 0 errors, 0 warnings, 0 section mismatches -------------------------------------------------------------------------------- integrator_defconfig (arm, gcc-10) — PASS, 0 errors, 0 warnings, 0 section mismatches Section mismatches: WARNING: vmlinux.o(___ksymtab_gpl+vic_init_cascaded+0x0): Section mismatch in reference from the variable __ksymtab_vic_init_cascaded to the function .init.text:vic_init_cascaded() -------------------------------------------------------------------------------- iop32x_defconfig (arm, gcc-10) — PASS, 0 errors, 0 warnings, 0 section mismatches -------------------------------------------------------------------------------- ip22_defconfig (mips, gcc-10) — PASS, 0 errors, 0 warnings, 0 section mismatches -------------------------------------------------------------------------------- ip27_defconfig (mips, gcc-10) — FAIL, 0 errors, 0 warnings, 0 section mismatches -------------------------------------------------------------------------------- ip28_defconfig (mips, gcc-10) — FAIL, 0 errors, 0 warnings, 0 section mismatches -------------------------------------------------------------------------------- ip32_defconfig (mips, gcc-10) — PASS, 0 errors, 0 warnings, 0 section mismatches -------------------------------------------------------------------------------- ixp4xx_defconfig (arm, gcc-10) — PASS, 0 errors, 0 warnings, 0 section mismatches Section mismatches: WARNING: vmlinux.o(___ksymtab_gpl+ixp4xx_irq_init+0x0): Section mismatch in reference from the variable __ksymtab_ixp4xx_irq_init to the function .init.text:ixp4xx_irq_init() -------------------------------------------------------------------------------- jazz_defconfig (mips, gcc-10) — PASS, 0 errors, 0 warnings, 0 section mismatches -------------------------------------------------------------------------------- jmr3927_defconfig (mips, gcc-10) — PASS, 0 errors, 0 warnings, 0 section mismatches -------------------------------------------------------------------------------- jornada720_defconfig (arm, gcc-10) — PASS, 0 errors, 0 warnings, 0 section mismatches -------------------------------------------------------------------------------- keystone_defconfig (arm, gcc-10) — PASS, 0 errors, 0 warnings, 0 section mismatches -------------------------------------------------------------------------------- lart_defconfig (arm, gcc-10) — PASS, 0 errors, 0 warnings, 0 section mismatches -------------------------------------------------------------------------------- lasat_defconfig (mips, gcc-10) — FAIL, 3 errors, 1 warning, 0 section mismatches Errors: arch/mips/lasat/picvue_proc.c:42:44: error: expected ‘)’ before ‘&’ token arch/mips/lasat/picvue_proc.c:87:20: error: ‘pvc_display_tasklet’ undeclared (first use in this function) arch/mips/lasat/picvue_proc.c:33:13: error: ‘pvc_display’ defined but not used [-Werror=unused-function] Warnings: cc1: all warnings being treated as errors -------------------------------------------------------------------------------- lemote2f_defconfig (mips, gcc-10) — PASS, 0 errors, 0 warnings, 0 section mismatches -------------------------------------------------------------------------------- loongson1b_defconfig (mips, gcc-10) — PASS, 0 errors, 0 warnings, 0 section mismatches -------------------------------------------------------------------------------- loongson1c_defconfig (mips, gcc-10) — PASS, 0 errors, 0 warnings, 0 section mismatches -------------------------------------------------------------------------------- loongson3_defconfig (mips, gcc-10) — PASS, 0 errors, 0 warnings, 0 section mismatches -------------------------------------------------------------------------------- lpc18xx_defconfig (arm, gcc-10) — PASS, 0 errors, 0 warnings, 0 section mismatches -------------------------------------------------------------------------------- lpc32xx_defconfig (arm, gcc-10) — PASS, 0 errors, 0 warnings, 0 section mismatches -------------------------------------------------------------------------------- lpd270_defconfig (arm, gcc-10) — PASS, 0 errors, 0 warnings, 0 section mismatches -------------------------------------------------------------------------------- lubbock_defconfig (arm, gcc-10) — PASS, 0 errors, 0 warnings, 0 section mismatches -------------------------------------------------------------------------------- magician_defconfig (arm, gcc-10) — PASS, 0 errors, 0 warnings, 0 section mismatches -------------------------------------------------------------------------------- mainstone_defconfig (arm, gcc-10) — PASS, 0 errors, 0 warnings, 0 section mismatches -------------------------------------------------------------------------------- malta_defconfig (mips, gcc-10) — PASS, 0 errors, 0 warnings, 0 section mismatches -------------------------------------------------------------------------------- malta_kvm_defconfig (mips, gcc-10) — PASS, 0 errors, 0 warnings, 0 section mismatches -------------------------------------------------------------------------------- malta_kvm_guest_defconfig (mips, gcc-10) — PASS, 0 errors, 0 warnings, 0 section mismatches -------------------------------------------------------------------------------- malta_qemu_32r6_defconfig (mips, gcc-10) — PASS, 0 errors, 0 warnings, 0 section mismatches -------------------------------------------------------------------------------- maltaaprp_defconfig (mips, gcc-10) — PASS, 0 errors, 0 warnings, 0 section mismatches -------------------------------------------------------------------------------- maltasmvp_defconfig (mips, gcc-10) — PASS, 0 errors, 0 warnings, 0 section mismatches -------------------------------------------------------------------------------- maltasmvp_eva_defconfig (mips, gcc-10) — PASS, 0 errors, 0 warnings, 0 section mismatches -------------------------------------------------------------------------------- maltaup_defconfig (mips, gcc-10) — PASS, 0 errors, 0 warnings, 0 section mismatches -------------------------------------------------------------------------------- maltaup_xpa_defconfig (mips, gcc-10) — PASS, 0 errors, 0 warnings, 0 section mismatches -------------------------------------------------------------------------------- markeins_defconfig (mips, gcc-10) — PASS, 0 errors, 0 warnings, 0 section mismatches -------------------------------------------------------------------------------- milbeaut_m10v_defconfig (arm, gcc-10) — PASS, 0 errors, 0 warnings, 0 section mismatches -------------------------------------------------------------------------------- mini2440_defconfig (arm, gcc-10) — PASS, 0 errors, 0 warnings, 0 section mismatches -------------------------------------------------------------------------------- mips_paravirt_defconfig (mips, gcc-10) — PASS, 0 errors, 0 warnings, 0 section mismatches -------------------------------------------------------------------------------- mmp2_defconfig (arm, gcc-10) — PASS, 0 errors, 0 warnings, 0 section mismatches -------------------------------------------------------------------------------- moxart_defconfig (arm, gcc-10) — PASS, 0 errors, 0 warnings, 0 section mismatches -------------------------------------------------------------------------------- mpc30x_defconfig (mips, gcc-10) — PASS, 0 errors, 0 warnings, 0 section mismatches -------------------------------------------------------------------------------- mps2_defconfig (arm, gcc-10) — PASS, 0 errors, 0 warnings, 0 section mismatches -------------------------------------------------------------------------------- msp71xx_defconfig (mips, gcc-10) — PASS, 0 errors, 0 warnings, 0 section mismatches -------------------------------------------------------------------------------- mtx1_defconfig (mips, gcc-10) — PASS, 0 errors, 3 warnings, 0 section mismatches Warnings: sound/pci/echoaudio/echoaudio_dsp.c:647:9: warning: iteration 1073741824 invokes undefined behavior [-Waggressive-loop-optimizations] sound/pci/echoaudio/echoaudio_dsp.c:658:9: warning: iteration 1073741824 invokes undefined behavior [-Waggressive-loop-optimizations] sound/pci/echoaudio/echoaudio_dsp.c:647:9: warning: iteration 1073741824 invokes undefined behavior [-Waggressive-loop-optimizations] -------------------------------------------------------------------------------- multi_v4t_defconfig (arm, gcc-10) — PASS, 0 errors, 0 warnings, 0 section mismatches -------------------------------------------------------------------------------- multi_v5_defconfig (arm, gcc-10) — PASS, 0 errors, 0 warnings, 0 section mismatches Section mismatches: WARNING: vmlinux.o(___ksymtab_gpl+vic_init_cascaded+0x0): Section mismatch in reference from the variable __ksymtab_vic_init_cascaded to the function .init.text:vic_init_cascaded() -------------------------------------------------------------------------------- multi_v7_defconfig (arm, gcc-10) — PASS, 0 errors, 0 warnings, 0 section mismatches -------------------------------------------------------------------------------- mvebu_v5_defconfig (arm, gcc-10) — PASS, 0 errors, 0 warnings, 0 section mismatches -------------------------------------------------------------------------------- mvebu_v7_defconfig (arm, gcc-10) — PASS, 0 errors, 0 warnings, 0 section mismatches -------------------------------------------------------------------------------- mxs_defconfig (arm, gcc-10) — PASS, 0 errors, 0 warnings, 0 section mismatches -------------------------------------------------------------------------------- neponset_defconfig (arm, gcc-10) — PASS, 0 errors, 1 warning, 0 section mismatches Warnings: drivers/video/fbdev/sa1100fb.c:975:21: warning: ‘sa1100fb_min_dma_period’ defined but not used [-Wunused-function] -------------------------------------------------------------------------------- netwinder_defconfig (arm, gcc-10) — PASS, 0 errors, 0 warnings, 0 section mismatches -------------------------------------------------------------------------------- nhk8815_defconfig (arm, gcc-10) — PASS, 0 errors, 0 warnings, 0 section mismatches Section mismatches: WARNING: vmlinux.o(___ksymtab_gpl+vic_init_cascaded+0x0): Section mismatch in reference from the variable __ksymtab_vic_init_cascaded to the function .init.text:vic_init_cascaded() -------------------------------------------------------------------------------- nlm_xlp_defconfig (mips, gcc-10) — PASS, 0 errors, 0 warnings, 0 section mismatches -------------------------------------------------------------------------------- nlm_xlr_defconfig (mips, gcc-10) — PASS, 0 errors, 0 warnings, 0 section mismatches -------------------------------------------------------------------------------- nsim_hs_defconfig (arc, gcc-10) — PASS, 0 errors, 0 warnings, 0 section mismatches -------------------------------------------------------------------------------- nsim_hs_smp_defconfig (arc, gcc-10) — PASS, 0 errors, 0 warnings, 0 section mismatches -------------------------------------------------------------------------------- nsimosci_hs_defconfig (arc, gcc-10) — PASS, 0 errors, 0 warnings, 0 section mismatches -------------------------------------------------------------------------------- nsimosci_hs_smp_defconfig (arc, gcc-10) — PASS, 0 errors, 0 warnings, 0 section mismatches -------------------------------------------------------------------------------- omap1_defconfig (arm, gcc-10) — PASS, 0 errors, 0 warnings, 0 section mismatches -------------------------------------------------------------------------------- omap2plus_defconfig (arm, gcc-10) — PASS, 0 errors, 0 warnings, 0 section mismatches -------------------------------------------------------------------------------- omega2p_defconfig (mips, gcc-10) — PASS, 0 errors, 0 warnings, 0 section mismatches -------------------------------------------------------------------------------- orion5x_defconfig (arm, gcc-10) — PASS, 0 errors, 0 warnings, 0 section mismatches -------------------------------------------------------------------------------- oxnas_v6_defconfig (arm, gcc-10) — PASS, 0 errors, 0 warnings, 0 section mismatches -------------------------------------------------------------------------------- palmz72_defconfig (arm, gcc-10) — PASS, 0 errors, 0 warnings, 0 section mismatches -------------------------------------------------------------------------------- pcm027_defconfig (arm, gcc-10) — PASS, 0 errors, 0 warnings, 0 section mismatches -------------------------------------------------------------------------------- pic32mzda_defconfig (mips, gcc-10) — PASS, 0 errors, 0 warnings, 0 section mismatches -------------------------------------------------------------------------------- pistachio_defconfig (mips, gcc-10) — PASS, 0 errors, 0 warnings, 0 section mismatches -------------------------------------------------------------------------------- pleb_defconfig (arm, gcc-10) — PASS, 0 errors, 0 warnings, 0 section mismatches -------------------------------------------------------------------------------- pnx8335_stb225_defconfig (mips, gcc-10) — PASS, 0 errors, 0 warnings, 0 section mismatches -------------------------------------------------------------------------------- prima2_defconfig (arm, gcc-10) — PASS, 0 errors, 0 warnings, 0 section mismatches -------------------------------------------------------------------------------- pxa168_defconfig (arm, gcc-10) — PASS, 0 errors, 0 warnings, 0 section mismatches -------------------------------------------------------------------------------- pxa255-idp_defconfig (arm, gcc-10) — PASS, 0 errors, 0 warnings, 0 section mismatches -------------------------------------------------------------------------------- pxa3xx_defconfig (arm, gcc-10) — PASS, 0 errors, 0 warnings, 0 section mismatches -------------------------------------------------------------------------------- pxa910_defconfig (arm, gcc-10) — PASS, 0 errors, 0 warnings, 0 section mismatches -------------------------------------------------------------------------------- pxa_defconfig (arm, gcc-10) — PASS, 0 errors, 0 warnings, 0 section mismatches -------------------------------------------------------------------------------- qcom_defconfig (arm, gcc-10) — PASS, 0 errors, 0 warnings, 0 section mismatches -------------------------------------------------------------------------------- qi_lb60_defconfig (mips, gcc-10) — PASS, 0 errors, 0 warnings, 0 section mismatches -------------------------------------------------------------------------------- rb532_defconfig (mips, gcc-10) — PASS, 0 errors, 0 warnings, 0 section mismatches -------------------------------------------------------------------------------- rbtx49xx_defconfig (mips, gcc-10) — PASS, 0 errors, 0 warnings, 0 section mismatches -------------------------------------------------------------------------------- realview_defconfig (arm, gcc-10) — PASS, 0 errors, 0 warnings, 0 section mismatches -------------------------------------------------------------------------------- rm200_defconfig (mips, gcc-10) — PASS, 0 errors, 0 warnings, 0 section mismatches -------------------------------------------------------------------------------- rt305x_defconfig (mips, gcc-10) — PASS, 0 errors, 0 warnings, 0 section mismatches -------------------------------------------------------------------------------- s3c2410_defconfig (arm, gcc-10) — PASS, 0 errors, 0 warnings, 0 section mismatches -------------------------------------------------------------------------------- s3c6400_defconfig (arm, gcc-10) — PASS, 0 errors, 0 warnings, 0 section mismatches Section mismatches: WARNING: vmlinux.o(___ksymtab_gpl+vic_init_cascaded+0x0): Section mismatch in reference from the variable __ksymtab_vic_init_cascaded to the function .init.text:vic_init_cascaded() -------------------------------------------------------------------------------- s5pv210_defconfig (arm, gcc-10) — PASS, 0 errors, 0 warnings, 0 section mismatches Section mismatches: WARNING: vmlinux.o(___ksymtab_gpl+vic_init_cascaded+0x0): Section mismatch in reference from the variable __ksymtab_vic_init_cascaded to the function .init.text:vic_init_cascaded() -------------------------------------------------------------------------------- sama5_defconfig (arm, gcc-10) — PASS, 0 errors, 0 warnings, 0 section mismatches -------------------------------------------------------------------------------- sb1250_swarm_defconfig (mips, gcc-10) — PASS, 0 errors, 0 warnings, 0 section mismatches -------------------------------------------------------------------------------- shannon_defconfig (arm, gcc-10) — PASS, 0 errors, 1 warning, 0 section mismatches Warnings: drivers/video/fbdev/sa1100fb.c:975:21: warning: ‘sa1100fb_min_dma_period’ defined but not used [-Wunused-function] -------------------------------------------------------------------------------- shmobile_defconfig (arm, gcc-10) — PASS, 0 errors, 0 warnings, 0 section mismatches -------------------------------------------------------------------------------- simpad_defconfig (arm, gcc-10) — PASS, 0 errors, 0 warnings, 0 section mismatches -------------------------------------------------------------------------------- socfpga_defconfig (arm, gcc-10) — PASS, 0 errors, 0 warnings, 0 section mismatches -------------------------------------------------------------------------------- spear13xx_defconfig (arm, gcc-10) — PASS, 0 errors, 0 warnings, 0 section mismatches -------------------------------------------------------------------------------- spear3xx_defconfig (arm, gcc-10) — PASS, 0 errors, 0 warnings, 0 section mismatches Section mismatches: WARNING: vmlinux.o(___ksymtab_gpl+vic_init_cascaded+0x0): Section mismatch in reference from the variable __ksymtab_vic_init_cascaded to the function .init.text:vic_init_cascaded() -------------------------------------------------------------------------------- spear6xx_defconfig (arm, gcc-10) — PASS, 0 errors, 0 warnings, 0 section mismatches Section mismatches: WARNING: vmlinux.o(___ksymtab_gpl+vic_init_cascaded+0x0): Section mismatch in reference from the variable __ksymtab_vic_init_cascaded to the function .init.text:vic_init_cascaded() -------------------------------------------------------------------------------- spitz_defconfig (arm, gcc-10) — PASS, 0 errors, 0 warnings, 0 section mismatches -------------------------------------------------------------------------------- stm32_defconfig (arm, gcc-10) — PASS, 0 errors, 0 warnings, 0 section mismatches -------------------------------------------------------------------------------- sunxi_defconfig (arm, gcc-10) — PASS, 0 errors, 0 warnings, 0 section mismatches -------------------------------------------------------------------------------- tango4_defconfig (arm, gcc-10) — PASS, 0 errors, 0 warnings, 0 section mismatches -------------------------------------------------------------------------------- tb0219_defconfig (mips, gcc-10) — PASS, 0 errors, 0 warnings, 0 section mismatches -------------------------------------------------------------------------------- tb0226_defconfig (mips, gcc-10) — PASS, 0 errors, 0 warnings, 0 section mismatches -------------------------------------------------------------------------------- tb0287_defconfig (mips, gcc-10) — PASS, 0 errors, 0 warnings, 0 section mismatches -------------------------------------------------------------------------------- tct_hammer_defconfig (arm, gcc-10) — PASS, 0 errors, 0 warnings, 0 section mismatches -------------------------------------------------------------------------------- tegra_defconfig (arm, gcc-10) — PASS, 0 errors, 0 warnings, 0 section mismatches -------------------------------------------------------------------------------- tinyconfig (x86_64, gcc-10) — PASS, 0 errors, 4 warnings, 0 section mismatches Warnings: arch/x86/entry/entry_64.S:1756: Warning: no instruction mnemonic suffix given and no register operands; using default for `sysret' arch/x86/entry/entry_64.o: warning: objtool: .entry.text+0x151: unsupported intra-function call ld: arch/x86/boot/compressed/head_64.o: warning: relocation in read-only section `.head.text' ld: warning: creating DT_TEXTREL in a PIE -------------------------------------------------------------------------------- tinyconfig (arc, gcc-10) — PASS, 0 errors, 0 warnings, 0 section mismatches -------------------------------------------------------------------------------- tinyconfig (i386, gcc-10) — PASS, 0 errors, 2 warnings, 0 section mismatches Warnings: ld: arch/x86/boot/compressed/head_32.o: warning: relocation in read-only section `.head.text' ld: warning: creating DT_TEXTREL in a PIE -------------------------------------------------------------------------------- trizeps4_defconfig (arm, gcc-10) — PASS, 0 errors, 0 warnings, 0 section mismatches -------------------------------------------------------------------------------- u300_defconfig (arm, gcc-10) — PASS, 0 errors, 0 warnings, 0 section mismatches Section mismatches: WARNING: vmlinux.o(___ksymtab_gpl+vic_init_cascaded+0x0): Section mismatch in reference from the variable __ksymtab_vic_init_cascaded to the function .init.text:vic_init_cascaded() -------------------------------------------------------------------------------- u8500_defconfig (arm, gcc-10) — PASS, 0 errors, 0 warnings, 0 section mismatches -------------------------------------------------------------------------------- vdk_hs38_defconfig (arc, gcc-10) — PASS, 0 errors, 0 warnings, 0 section mismatches -------------------------------------------------------------------------------- vdk_hs38_smp_defconfig (arc, gcc-10) — PASS, 0 errors, 0 warnings, 0 section mismatches -------------------------------------------------------------------------------- versatile_defconfig (arm, gcc-10) — PASS, 0 errors, 0 warnings, 0 section mismatches Section mismatches: WARNING: vmlinux.o(___ksymtab_gpl+vic_init_cascaded+0x0): Section mismatch in reference from the variable __ksymtab_vic_init_cascaded to the function .init.text:vic_init_cascaded() -------------------------------------------------------------------------------- vexpress_defconfig (arm, gcc-10) — PASS, 0 errors, 0 warnings, 0 section mismatches -------------------------------------------------------------------------------- vf610m4_defconfig (arm, gcc-10) — PASS, 0 errors, 0 warnings, 0 section mismatches -------------------------------------------------------------------------------- viper_defconfig (arm, gcc-10) — PASS, 0 errors, 0 warnings, 0 section mismatches -------------------------------------------------------------------------------- vocore2_defconfig (mips, gcc-10) — PASS, 0 errors, 0 warnings, 0 section mismatches -------------------------------------------------------------------------------- vt8500_v6_v7_defconfig (arm, gcc-10) — PASS, 0 errors, 0 warnings, 0 section mismatches -------------------------------------------------------------------------------- workpad_defconfig (mips, gcc-10) — PASS, 0 errors, 0 warnings, 0 section mismatches -------------------------------------------------------------------------------- x86_64_defconfig (x86_64, gcc-10) — PASS, 0 errors, 4 warnings, 0 section mismatches Warnings: arch/x86/entry/entry_64.o: warning: objtool: .entry.text+0x1c1: unsupported intra-function call arch/x86/entry/entry_64.o: warning: objtool: If this is a retpoline, please patch it in with alternatives and annotate it with ANNOTATE_NOSPEC_ALTERNATIVE. ld: arch/x86/boot/compressed/head_64.o: warning: relocation in read-only section `.head.text' ld: warning: creating DT_TEXTREL in a PIE -------------------------------------------------------------------------------- x86_64_defconfig+x86-chromebook (x86_64, gcc-10) — PASS, 0 errors, 4 warnings, 0 section mismatches Warnings: arch/x86/entry/entry_64.o: warning: objtool: .entry.text+0x1c1: unsupported intra-function call arch/x86/entry/entry_64.o: warning: objtool: If this is a retpoline, please patch it in with alternatives and annotate it with ANNOTATE_NOSPEC_ALTERNATIVE. ld: arch/x86/boot/compressed/head_64.o: warning: relocation in read-only section `.head.text' ld: warning: creating DT_TEXTREL in a PIE -------------------------------------------------------------------------------- xcep_defconfig (arm, gcc-10) — PASS, 0 errors, 0 warnings, 0 section mismatches -------------------------------------------------------------------------------- zeus_defconfig (arm, gcc-10) — PASS, 0 errors, 0 warnings, 0 section mismatches -------------------------------------------------------------------------------- zx_defconfig (arm, gcc-10) — PASS, 0 errors, 0 warnings, 0 section mismatches --- For more info write to <info(a)kernelci.org>
1 year, 11 months
1
0
0
0
← Newer
1
...
66
67
68
69
70
71
72
...
189
Older →
Jump to page:
1
2
3
4
5
6
7
8
9
10
11
12
13
14
15
16
17
18
19
20
21
22
23
24
25
26
27
28
29
30
31
32
33
34
35
36
37
38
39
40
41
42
43
44
45
46
47
48
49
50
51
52
53
54
55
56
57
58
59
60
61
62
63
64
65
66
67
68
69
70
71
72
73
74
75
76
77
78
79
80
81
82
83
84
85
86
87
88
89
90
91
92
93
94
95
96
97
98
99
100
101
102
103
104
105
106
107
108
109
110
111
112
113
114
115
116
117
118
119
120
121
122
123
124
125
126
127
128
129
130
131
132
133
134
135
136
137
138
139
140
141
142
143
144
145
146
147
148
149
150
151
152
153
154
155
156
157
158
159
160
161
162
163
164
165
166
167
168
169
170
171
172
173
174
175
176
177
178
179
180
181
182
183
184
185
186
187
188
189
Results per page:
10
25
50
100
200