lists.linaro.org
Sign In
Sign Up
Sign In
Sign Up
Manage this list
×
Keyboard Shortcuts
Thread View
j
: Next unread message
k
: Previous unread message
j a
: Jump to all threads
j l
: Jump to MailingList overview
2025
February
January
2024
December
November
October
September
August
July
June
May
April
March
February
January
2023
December
November
October
September
August
July
June
May
April
March
February
January
2022
December
November
October
September
August
July
June
May
April
March
February
January
2021
December
November
October
September
August
July
June
May
April
March
February
January
2020
December
November
October
September
August
July
June
May
April
March
February
January
2019
December
November
October
September
August
July
June
May
April
March
February
January
2018
December
November
October
September
August
July
June
May
April
March
February
January
2017
December
November
List overview
Download
Lkft-triage
November 2019
----- 2025 -----
February 2025
January 2025
----- 2024 -----
December 2024
November 2024
October 2024
September 2024
August 2024
July 2024
June 2024
May 2024
April 2024
March 2024
February 2024
January 2024
----- 2023 -----
December 2023
November 2023
October 2023
September 2023
August 2023
July 2023
June 2023
May 2023
April 2023
March 2023
February 2023
January 2023
----- 2022 -----
December 2022
November 2022
October 2022
September 2022
August 2022
July 2022
June 2022
May 2022
April 2022
March 2022
February 2022
January 2022
----- 2021 -----
December 2021
November 2021
October 2021
September 2021
August 2021
July 2021
June 2021
May 2021
April 2021
March 2021
February 2021
January 2021
----- 2020 -----
December 2020
November 2020
October 2020
September 2020
August 2020
July 2020
June 2020
May 2020
April 2020
March 2020
February 2020
January 2020
----- 2019 -----
December 2019
November 2019
October 2019
September 2019
August 2019
July 2019
June 2019
May 2019
April 2019
March 2019
February 2019
January 2019
----- 2018 -----
December 2018
November 2018
October 2018
September 2018
August 2018
July 2018
June 2018
May 2018
April 2018
March 2018
February 2018
January 2018
----- 2017 -----
December 2017
November 2017
lkft-triage@lists.linaro.org
34 participants
601 discussions
Start a n
N
ew thread
next 5.4.0/1875ff320f14: regressions detected in project next on OE
by Linaro QA
Summary ------------------------------------------------------------------------ kernel: 5.4.0 git repo:
https://git.kernel.org/pub/scm/linux/kernel/git/next/linux-next.git
git branch: master git commit: 1875ff320f14afe21731a6e4c7b46dd33e45dfaa git describe: next-20191127 Test details:
https://qa-reports.linaro.org/lkft/linux-next-oe/build/next-20191127
Regressions (compared to build next-20191125) ------------------------------------------------------------------------ qemu_x86_64: kselftest: * livepatch_test-callbacks.sh x86: kselftest-vsyscall-mode-native: * net_fib-onlink-tests.sh Fixes (compared to build next-20191125) ------------------------------------------------------------------------ dragonboard-410c: linux-log-parser: * check-oops qemu_x86_64: kselftest: * net_traceroute.sh * x86_iopl_64 ltp-syscalls-tests: * accept02 * iopl01 x86: kselftest-vsyscall-mode-native: * net_so_txtime.sh * x86_iopl_64 kselftest-vsyscall-mode-none: * net_so_txtime.sh * x86_iopl_64 kselftest: * net_so_txtime.sh * x86_iopl_64 ltp-syscalls-tests: * iopl01 Boards, architectures and test suites: ------------------------------------- dragonboard-410c - arm64 * build - pass: 1, * install-android-platform-tools-r2600 - pass: 32, * kselftest - fail: 48, pass: 21, skip: 5, * libgpiod - pass: 117, * libhugetlbfs - pass: 89, skip: 1, xfail: 1 * linux-log-parser - fail: 6, pass: 30, * ltp-cap_bounds-tests - pass: 1, * ltp-commands-tests - pass: 28, skip: 14, * ltp-containers-tests - pass: 80, * ltp-cpuhotplug-tests - pass: 5, skip: 1, * ltp-cve-tests - fail: 1, pass: 28, skip: 11, * ltp-fcntl-locktests-tests - pass: 1, * ltp-filecaps-tests - pass: 1, * ltp-fs-tests - pass: 59, skip: 7, xfail: 1 * ltp-fs_bind-tests - pass: 1, * ltp-fs_perms_simple-tests - pass: 18, * ltp-fsx-tests - pass: 1, * ltp-hugetlb-tests - pass: 19, skip: 2, * ltp-ipc-tests - pass: 8, * ltp-math-tests - pass: 10, * ltp-mm-tests - pass: 54, skip: 19, xfail: 1 * ltp-nptl-tests - pass: 1, * ltp-pty-tests - pass: 4, * ltp-sched-tests - pass: 10, * ltp-securebits-tests - pass: 3, * ltp-syscalls-tests - fail: 1, pass: 1094, skip: 152, xfail: 3 * perf - fail: 4, pass: 57, skip: 9, * spectre-meltdown-checker-test - pass: 12, * v4l2-compliance - pass: 43, xfail: 2 hi6220-hikey - arm64 * build - pass: 1, * linux-log-parser - pass: 2, i386 * build - fail: 1, * linux-log-parser - pass: 2, juno-r2 - arm64 * build - pass: 1, * linux-log-parser - pass: 42, qemu_arm64 * kselftest - fail: 98, pass: 85, skip: 19, * libgpiod - pass: 117, * libhugetlbfs - pass: 90, skip: 1, * linux-log-parser - pass: 34, * ltp-cap_bounds-tests - pass: 1, * ltp-commands-tests - pass: 28, skip: 14, * ltp-containers-tests - pass: 80, * ltp-cpuhotplug-tests - pass: 5, skip: 1, * ltp-cve-tests - pass: 29, skip: 11, * ltp-dio-tests - pass: 19, skip: 11, * ltp-fcntl-locktests-tests - pass: 1, * ltp-filecaps-tests - pass: 1, * ltp-fs-tests - pass: 59, skip: 7, xfail: 1 * ltp-fs_bind-tests - pass: 1, * ltp-fs_perms_simple-tests - pass: 18, * ltp-fsx-tests - pass: 1, * ltp-hugetlb-tests - pass: 21, * ltp-io-tests - pass: 1, xfail: 1 * ltp-ipc-tests - pass: 8, * ltp-math-tests - pass: 10, * ltp-mm-tests - pass: 56, skip: 18, xfail: 1 * ltp-nptl-tests - pass: 1, * ltp-pty-tests - pass: 4, * ltp-sched-tests - pass: 4, skip: 6, * ltp-securebits-tests - pass: 3, * ltp-syscalls-tests - fail: 3, pass: 1080, skip: 165, xfail: 2 * perf - fail: 4, pass: 56, skip: 9, xfail: 1 * spectre-meltdown-checker-test - pass: 12, * v4l2-compliance - pass: 43, xfail: 2 qemu_x86_64 * kselftest - fail: 67, pass: 121, skip: 17, * libgpiod - pass: 117, * libhugetlbfs - pass: 90, skip: 1, * linux-log-parser - pass: 34, * ltp-cap_bounds-tests - pass: 1, * ltp-commands-tests - pass: 28, skip: 14, * ltp-containers-tests - pass: 80, * ltp-cpuhotplug-tests - pass: 5, skip: 1, * ltp-cve-tests - pass: 34, skip: 6, * ltp-dio-tests - pass: 19, skip: 11, * ltp-fcntl-locktests-tests - pass: 1, * ltp-filecaps-tests - pass: 1, * ltp-fs-tests - pass: 62, skip: 5, * ltp-fs_bind-tests - pass: 1, * ltp-fs_perms_simple-tests - pass: 18, * ltp-fsx-tests - pass: 1, * ltp-hugetlb-tests - pass: 21, * ltp-io-tests - pass: 1, xfail: 1 * ltp-ipc-tests - pass: 8, * ltp-math-tests - pass: 10, * ltp-mm-tests - pass: 56, skip: 18, xfail: 1 * ltp-nptl-tests - pass: 1, * ltp-pty-tests - pass: 4, * ltp-sched-tests - pass: 10, * ltp-securebits-tests - pass: 3, * ltp-syscalls-tests - pass: 1076, skip: 174, * perf - fail: 4, pass: 63, skip: 10, * spectre-meltdown-checker-test - pass: 12, * v4l2-compliance - pass: 42, xfail: 2 x15 - arm * build - fail: 1, * linux-log-parser - pass: 2, x86_64 * build - pass: 1, * kselftest - fail: 69, pass: 123, skip: 13, * kselftest-vsyscall-mode-native - fail: 67, pass: 122, skip: 12, * kselftest-vsyscall-mode-none - fail: 68, pass: 123, skip: 13, * kvm-unit-tests - fail: 1, pass: 45, skip: 10, * libgpiod - pass: 117, * libhugetlbfs - pass: 89, skip: 1, * linux-log-parser - pass: 48, * ltp-cap_bounds-tests - pass: 1, * ltp-commands-tests - pass: 28, skip: 14, * ltp-containers-tests - pass: 80, * ltp-cpuhotplug-tests - pass: 5, skip: 1, * ltp-cve-tests - pass: 34, skip: 6, * ltp-dio-tests - pass: 19, skip: 11, * ltp-fcntl-locktests-tests - pass: 1, * ltp-filecaps-tests - pass: 1, * ltp-fs-tests - pass: 62, skip: 5, * ltp-fs_bind-tests - pass: 1, * ltp-fs_perms_simple-tests - pass: 18, * ltp-fsx-tests - pass: 1, * ltp-hugetlb-tests - pass: 21, * ltp-io-tests - pass: 2, * ltp-ipc-tests - pass: 8, * ltp-math-tests - pass: 10, * ltp-mm-tests - pass: 56, skip: 18, xfail: 1 * ltp-nptl-tests - pass: 1, * ltp-open-posix-tests - pass: 1693, skip: 42, xfail: 4 * ltp-pty-tests - pass: 4, * ltp-sched-tests - pass: 6, skip: 4, * ltp-securebits-tests - pass: 3, * ltp-syscalls-tests - pass: 1106, skip: 143, xfail: 1 * network-basic-tests - pass: 9, skip: 1, * perf - fail: 4, pass: 63, skip: 10, * spectre-meltdown-checker-test - fail: 4, pass: 5, xfail: 3 * ssuite - fail: 48, * v4l2-compliance - pass: 42, xfail: 2 -- Linaro QA
https://qa-reports.linaro.org
5 years, 3 months
1
0
0
0
mainline 5.4.0/89d57dddd7d3: regressions detected in project mainline on OE
by Linaro QA
Summary ------------------------------------------------------------------------ kernel: 5.4.0 git repo:
https://git.kernel.org/pub/scm/linux/kernel/git/torvalds/linux.git
git branch: master git commit: 89d57dddd7d319ded00415790a0bb3c954b7e386 git describe: v5.4-5280-g89d57dddd7d3 Test details:
https://qa-reports.linaro.org/lkft/linux-mainline-oe/build/v5.4-5280-g89d57…
Regressions (compared to build v5.4-3600-ga86f69d33495) ------------------------------------------------------------------------ juno-r2: kvm-unit-tests: * pmu Fixes (compared to build v5.4-3600-ga86f69d33495) ------------------------------------------------------------------------ dragonboard-410c: linux-log-parser: * check-oops ltp-cve-tests: * cve-2017-1000380 juno-r2: kselftest: * memfd_run_hugetlbfs_test.sh qemu_arm64: kselftest: * memfd_run_hugetlbfs_test.sh Boards, architectures and test suites: ------------------------------------- dragonboard-410c - arm64 * build - pass: 1, * install-android-platform-tools-r2600 - pass: 34, * kselftest - fail: 53, pass: 89, skip: 18, xfail: 40 * libgpiod - pass: 116, * libhugetlbfs - pass: 89, skip: 1, xfail: 1 * linux-log-parser - fail: 4, pass: 32, * ltp-cap_bounds-tests - pass: 1, * ltp-commands-tests - pass: 28, skip: 14, * ltp-containers-tests - pass: 80, * ltp-cpuhotplug-tests - pass: 5, skip: 1, * ltp-cve-tests - pass: 29, skip: 11, * ltp-dio-tests - pass: 10, skip: 20, * ltp-fcntl-locktests-tests - pass: 1, * ltp-filecaps-tests - pass: 1, * ltp-fs-tests - pass: 59, skip: 7, xfail: 1 * ltp-fs_bind-tests - pass: 1, * ltp-fs_perms_simple-tests - pass: 18, * ltp-fsx-tests - pass: 1, * ltp-hugetlb-tests - pass: 19, skip: 2, * ltp-io-tests - pass: 2, * ltp-ipc-tests - pass: 8, * ltp-math-tests - pass: 10, * ltp-mm-tests - pass: 54, skip: 19, xfail: 1 * ltp-nptl-tests - pass: 1, * ltp-pty-tests - pass: 4, * ltp-sched-tests - pass: 10, * ltp-securebits-tests - pass: 3, * ltp-syscalls-tests - pass: 1096, skip: 152, xfail: 2 * perf - fail: 4, pass: 56, skip: 9, xfail: 1 * spectre-meltdown-checker-test - pass: 12, * v4l2-compliance - pass: 43, xfail: 2 hi6220-hikey - arm64 * build - pass: 1, * linux-log-parser - pass: 2, i386 * build - fail: 1, * linux-log-parser - pass: 2, juno-r2 - arm64 * build - pass: 1, * kselftest - fail: 54, pass: 90, skip: 18, xfail: 39 * kvm-unit-tests - fail: 2, pass: 11, skip: 3, * libgpiod - pass: 117, * libhugetlbfs - pass: 90, skip: 1, * linux-log-parser - pass: 42, * ltp-cap_bounds-tests - pass: 1, * ltp-commands-tests - pass: 28, skip: 14, * ltp-containers-tests - pass: 80, * ltp-cpuhotplug-tests - pass: 5, skip: 1, * ltp-cve-tests - pass: 29, skip: 11, * ltp-dio-tests - pass: 19, skip: 11, * ltp-fcntl-locktests-tests - pass: 1, * ltp-filecaps-tests - pass: 1, * ltp-fs-tests - pass: 59, skip: 7, xfail: 1 * ltp-fs_bind-tests - pass: 1, * ltp-fs_perms_simple-tests - pass: 18, * ltp-fsx-tests - pass: 1, * ltp-hugetlb-tests - pass: 21, * ltp-io-tests - pass: 2, * ltp-ipc-tests - pass: 8, * ltp-math-tests - pass: 10, * ltp-mm-tests - pass: 56, skip: 18, xfail: 1 * ltp-nptl-tests - pass: 1, * ltp-open-posix-tests - pass: 1693, skip: 42, xfail: 4 * ltp-pty-tests - pass: 4, * ltp-sched-tests - pass: 6, skip: 4, * ltp-securebits-tests - pass: 3, * ltp-syscalls-tests - pass: 1099, skip: 149, xfail: 2 * network-basic-tests - pass: 10, skip: 1, * perf - fail: 5, pass: 54, skip: 10, xfail: 1 * spectre-meltdown-checker-test - pass: 10, xfail: 2 * v4l2-compliance - pass: 43, xfail: 2 qemu_arm64 * kselftest - fail: 54, pass: 89, skip: 18, xfail: 39 * libgpiod - pass: 117, * libhugetlbfs - pass: 90, skip: 1, * linux-log-parser - pass: 34, * ltp-cap_bounds-tests - pass: 1, * ltp-commands-tests - pass: 28, skip: 14, * ltp-containers-tests - pass: 80, * ltp-cpuhotplug-tests - pass: 5, skip: 1, * ltp-cve-tests - pass: 29, skip: 11, * ltp-dio-tests - pass: 19, skip: 11, * ltp-fcntl-locktests-tests - pass: 1, * ltp-filecaps-tests - pass: 1, * ltp-fs-tests - pass: 59, skip: 7, xfail: 1 * ltp-fs_bind-tests - pass: 1, * ltp-fs_perms_simple-tests - pass: 18, * ltp-fsx-tests - pass: 1, * ltp-hugetlb-tests - pass: 21, * ltp-io-tests - pass: 1, xfail: 1 * ltp-ipc-tests - pass: 8, * ltp-math-tests - pass: 10, * ltp-mm-tests - pass: 56, skip: 18, xfail: 1 * ltp-nptl-tests - pass: 1, * ltp-pty-tests - pass: 4, * ltp-sched-tests - pass: 4, skip: 6, * ltp-securebits-tests - pass: 3, * ltp-syscalls-tests - fail: 2, pass: 1081, skip: 165, xfail: 2 * perf - fail: 4, pass: 56, skip: 9, xfail: 1 * spectre-meltdown-checker-test - pass: 12, * v4l2-compliance - pass: 43, xfail: 2 qemu_x86_64 * kselftest - fail: 29, pass: 120, skip: 18, xfail: 36 * libgpiod - pass: 117, * libhugetlbfs - pass: 90, skip: 1, * linux-log-parser - pass: 34, * ltp-cap_bounds-tests - pass: 1, * ltp-commands-tests - pass: 28, skip: 14, * ltp-containers-tests - pass: 80, * ltp-cpuhotplug-tests - pass: 5, skip: 1, * ltp-cve-tests - pass: 34, skip: 6, * ltp-dio-tests - pass: 19, skip: 11, * ltp-fcntl-locktests-tests - pass: 1, * ltp-filecaps-tests - pass: 1, * ltp-fs-tests - pass: 62, skip: 5, * ltp-fs_bind-tests - pass: 1, * ltp-fs_perms_simple-tests - pass: 18, * ltp-fsx-tests - pass: 1, * ltp-hugetlb-tests - pass: 21, * ltp-io-tests - pass: 1, xfail: 1 * ltp-ipc-tests - pass: 8, * ltp-math-tests - pass: 10, * ltp-mm-tests - pass: 56, skip: 18, xfail: 1 * ltp-nptl-tests - pass: 1, * ltp-pty-tests - pass: 4, * ltp-sched-tests - pass: 10, * ltp-securebits-tests - pass: 3, * ltp-syscalls-tests - pass: 1076, skip: 174, * perf - fail: 4, pass: 63, skip: 10, * spectre-meltdown-checker-test - pass: 12, * v4l2-compliance - pass: 42, xfail: 2 x15 - arm * build - fail: 1, * linux-log-parser - pass: 2, x86_64 * build - pass: 1, * kselftest - fail: 33, pass: 121, skip: 13, xfail: 36 * kselftest-vsyscall-mode-native - fail: 43, pass: 120, skip: 13, xfail: 25 * kselftest-vsyscall-mode-none - fail: 43, pass: 123, skip: 13, xfail: 23 * kvm-unit-tests - fail: 1, pass: 45, skip: 10, * libgpiod - pass: 117, * libhugetlbfs - pass: 90, skip: 1, * linux-log-parser - pass: 48, * ltp-cap_bounds-tests - pass: 1, * ltp-commands-tests - pass: 28, skip: 14, * ltp-containers-tests - pass: 80, * ltp-cpuhotplug-tests - pass: 5, skip: 1, * ltp-cve-tests - pass: 34, skip: 6, * ltp-dio-tests - pass: 19, skip: 11, * ltp-fcntl-locktests-tests - pass: 1, * ltp-filecaps-tests - pass: 1, * ltp-fs-tests - pass: 62, skip: 5, * ltp-fs_bind-tests - pass: 1, * ltp-fs_perms_simple-tests - pass: 18, * ltp-fsx-tests - pass: 1, * ltp-hugetlb-tests - pass: 21, * ltp-io-tests - pass: 2, * ltp-ipc-tests - pass: 8, * ltp-math-tests - pass: 10, * ltp-mm-tests - pass: 56, skip: 18, xfail: 1 * ltp-nptl-tests - pass: 1, * ltp-open-posix-tests - pass: 1693, skip: 42, xfail: 4 * ltp-pty-tests - pass: 4, * ltp-sched-tests - pass: 6, skip: 4, * ltp-securebits-tests - pass: 3, * ltp-syscalls-tests - pass: 1106, skip: 143, xfail: 1 * network-basic-tests - pass: 10, skip: 1, * perf - fail: 4, pass: 63, skip: 10, * spectre-meltdown-checker-test - fail: 4, pass: 8, * ssuite - fail: 24, * v4l2-compliance - pass: 42, xfail: 2 -- Linaro QA
https://qa-reports.linaro.org
5 years, 3 months
1
0
0
0
mainline 5.4.0/a86f69d33495: regressions detected in project mainline on OE
by Linaro QA
Summary ------------------------------------------------------------------------ kernel: 5.4.0 git repo:
https://git.kernel.org/pub/scm/linux/kernel/git/torvalds/linux.git
git branch: master git commit: a86f69d3349569a610eb9ff3b9e4bd1c40fe62f2 git describe: v5.4-3600-ga86f69d33495 Test details:
https://qa-reports.linaro.org/lkft/linux-mainline-oe/build/v5.4-3600-ga86f6…
Regressions (compared to build v5.4-3419-g386403a115f9) ------------------------------------------------------------------------ dragonboard-410c: linux-log-parser: * check-oops ltp-cve-tests: * cve-2017-1000380 No fixes (compared to build v5.4-3419-g386403a115f9) Boards, architectures and test suites: ------------------------------------- dragonboard-410c - arm64 * build - pass: 1, * install-android-platform-tools-r2600 - pass: 32, * kselftest - fail: 35, pass: 23, skip: 4, xfail: 13 * libgpiod - pass: 115, * libhugetlbfs - pass: 89, skip: 1, xfail: 1 * linux-log-parser - fail: 2, pass: 34, * ltp-cap_bounds-tests - pass: 1, * ltp-commands-tests - pass: 28, skip: 14, * ltp-cpuhotplug-tests - pass: 5, skip: 1, * ltp-cve-tests - fail: 1, pass: 28, skip: 11, * ltp-dio-tests - pass: 10, skip: 20, * ltp-fcntl-locktests-tests - pass: 1, * ltp-filecaps-tests - pass: 1, * ltp-fs-tests - pass: 59, skip: 7, xfail: 1 * ltp-fs_bind-tests - pass: 1, * ltp-fs_perms_simple-tests - pass: 18, * ltp-fsx-tests - pass: 1, * ltp-hugetlb-tests - pass: 19, skip: 2, * ltp-io-tests - pass: 2, * ltp-ipc-tests - pass: 8, * ltp-math-tests - pass: 10, * ltp-mm-tests - pass: 54, skip: 19, xfail: 1 * ltp-nptl-tests - pass: 1, * ltp-pty-tests - pass: 4, * ltp-sched-tests - pass: 10, * ltp-securebits-tests - pass: 3, * perf - fail: 6, pass: 57, skip: 9, * spectre-meltdown-checker-test - pass: 12, * v4l2-compliance - pass: 43, xfail: 2 hi6220-hikey - arm64 * build - pass: 1, * install-android-platform-tools-r2600 - pass: 72, * kselftest - fail: 69, pass: 45, skip: 9, xfail: 36 * libgpiod - pass: 234, * libhugetlbfs - pass: 180, skip: 2, * linux-log-parser - pass: 74, * ltp-cap_bounds-tests - pass: 2, * ltp-commands-tests - pass: 56, skip: 28, * ltp-containers-tests - pass: 160, * ltp-cpuhotplug-tests - pass: 10, skip: 2, * ltp-cve-tests - pass: 58, skip: 22, * ltp-dio-tests - pass: 38, skip: 22, * ltp-fcntl-locktests-tests - pass: 2, * ltp-filecaps-tests - pass: 2, * ltp-fs_bind-tests - pass: 2, * ltp-fs_perms_simple-tests - pass: 36, * ltp-fsx-tests - pass: 2, * ltp-hugetlb-tests - pass: 20, skip: 1, * ltp-io-tests - pass: 4, * ltp-ipc-tests - pass: 16, * ltp-math-tests - pass: 20, * ltp-nptl-tests - pass: 2, * ltp-pty-tests - pass: 8, * ltp-sched-tests - pass: 12, skip: 8, * ltp-securebits-tests - pass: 6, * network-basic-tests - pass: 20, skip: 2, * perf - fail: 12, pass: 106, skip: 24, xfail: 2 * spectre-meltdown-checker-test - pass: 24, * v4l2-compliance - pass: 86, xfail: 4 i386 * build - fail: 2, * linux-log-parser - pass: 4, juno-r2 - arm64 * build - pass: 1, * kselftest - fail: 93, pass: 114, skip: 25, xfail: 58 * kvm-unit-tests - fail: 2, pass: 24, skip: 6, * libgpiod - pass: 234, * libhugetlbfs - pass: 180, skip: 2, * linux-log-parser - pass: 82, * ltp-cap_bounds-tests - pass: 2, * ltp-commands-tests - pass: 56, skip: 28, * ltp-containers-tests - pass: 160, * ltp-cpuhotplug-tests - pass: 10, skip: 2, * ltp-cve-tests - pass: 58, skip: 22, * ltp-dio-tests - pass: 38, skip: 22, * ltp-fcntl-locktests-tests - pass: 2, * ltp-filecaps-tests - pass: 2, * ltp-fs-tests - pass: 118, skip: 14, xfail: 2 * ltp-fs_bind-tests - pass: 2, * ltp-fs_perms_simple-tests - pass: 36, * ltp-fsx-tests - pass: 2, * ltp-hugetlb-tests - pass: 42, * ltp-io-tests - pass: 4, * ltp-ipc-tests - pass: 16, * ltp-math-tests - pass: 20, * ltp-mm-tests - pass: 112, skip: 36, xfail: 2 * ltp-nptl-tests - pass: 2, * ltp-open-posix-tests - pass: 1693, skip: 42, xfail: 4 * ltp-pty-tests - pass: 8, * ltp-sched-tests - pass: 12, skip: 8, * ltp-securebits-tests - pass: 6, * network-basic-tests - pass: 20, skip: 2, * spectre-meltdown-checker-test - pass: 20, xfail: 4 * v4l2-compliance - pass: 86, xfail: 4 qemu_arm64 * kselftest - fail: 96, pass: 116, skip: 30, xfail: 65 * libgpiod - pass: 234, * libhugetlbfs - pass: 180, skip: 2, * linux-log-parser - pass: 68, * ltp-cap_bounds-tests - pass: 2, * ltp-commands-tests - pass: 56, skip: 28, * ltp-containers-tests - pass: 160, * ltp-cpuhotplug-tests - pass: 10, skip: 2, * ltp-cve-tests - pass: 58, skip: 22, * ltp-dio-tests - pass: 38, skip: 22, * ltp-fcntl-locktests-tests - pass: 2, * ltp-filecaps-tests - pass: 2, * ltp-fs-tests - pass: 118, skip: 14, xfail: 2 * ltp-fs_bind-tests - pass: 2, * ltp-fs_perms_simple-tests - pass: 36, * ltp-fsx-tests - pass: 2, * ltp-hugetlb-tests - pass: 42, * ltp-io-tests - pass: 2, xfail: 2 * ltp-ipc-tests - pass: 16, * ltp-math-tests - pass: 20, * ltp-mm-tests - pass: 112, skip: 36, xfail: 2 * ltp-nptl-tests - pass: 2, * ltp-pty-tests - pass: 8, * ltp-sched-tests - pass: 8, skip: 12, * ltp-securebits-tests - pass: 6, * perf - fail: 12, pass: 113, skip: 18, xfail: 1 * spectre-meltdown-checker-test - pass: 24, * v4l2-compliance - pass: 86, xfail: 4 qemu_x86_64 * kselftest - fail: 19, pass: 32, skip: 13, xfail: 22 * libgpiod - pass: 117, * libhugetlbfs - pass: 90, skip: 1, * linux-log-parser - pass: 34, * ltp-cap_bounds-tests - pass: 1, * ltp-commands-tests - pass: 28, skip: 14, * ltp-containers-tests - pass: 80, * ltp-cpuhotplug-tests - pass: 5, skip: 1, * ltp-cve-tests - pass: 34, skip: 6, * ltp-dio-tests - pass: 19, skip: 11, * ltp-fcntl-locktests-tests - pass: 1, * ltp-filecaps-tests - pass: 1, * ltp-fs-tests - pass: 62, skip: 5, * ltp-fs_bind-tests - pass: 1, * ltp-fs_perms_simple-tests - pass: 18, * ltp-fsx-tests - pass: 1, * ltp-hugetlb-tests - pass: 21, * ltp-io-tests - pass: 1, xfail: 1 * ltp-ipc-tests - pass: 8, * ltp-math-tests - pass: 10, * ltp-mm-tests - pass: 56, skip: 18, xfail: 1 * ltp-nptl-tests - pass: 1, * ltp-pty-tests - pass: 4, * ltp-sched-tests - pass: 10, * ltp-securebits-tests - pass: 3, * perf - fail: 4, pass: 63, skip: 10, * spectre-meltdown-checker-test - pass: 12, * v4l2-compliance - pass: 42, xfail: 2 x15 - arm * build - fail: 1, * linux-log-parser - pass: 2, x86_64 * build - pass: 1, * kselftest - fail: 21, pass: 39, skip: 10, xfail: 23 * kselftest-vsyscall-mode-native - fail: 32, pass: 40, skip: 10, xfail: 13 * kselftest-vsyscall-mode-none - fail: 31, pass: 39, skip: 9, xfail: 13 * kvm-unit-tests - fail: 1, pass: 45, skip: 10, * libgpiod - pass: 117, * libhugetlbfs - pass: 90, skip: 1, * linux-log-parser - pass: 48, * ltp-cap_bounds-tests - pass: 1, * ltp-commands-tests - pass: 28, skip: 14, * ltp-containers-tests - pass: 80, * ltp-cpuhotplug-tests - pass: 5, skip: 1, * ltp-cve-tests - pass: 34, skip: 6, * ltp-dio-tests - pass: 19, skip: 11, * ltp-fcntl-locktests-tests - pass: 1, * ltp-filecaps-tests - pass: 1, * ltp-fs-tests - pass: 62, skip: 5, * ltp-fs_bind-tests - pass: 1, * ltp-fs_perms_simple-tests - pass: 18, * ltp-fsx-tests - pass: 1, * ltp-hugetlb-tests - pass: 21, * ltp-io-tests - pass: 2, * ltp-ipc-tests - pass: 8, * ltp-math-tests - pass: 10, * ltp-mm-tests - pass: 56, skip: 18, xfail: 1 * ltp-nptl-tests - pass: 1, * ltp-open-posix-tests - pass: 1693, skip: 42, xfail: 4 * ltp-pty-tests - pass: 4, * ltp-sched-tests - pass: 6, skip: 4, * ltp-securebits-tests - pass: 3, * network-basic-tests - pass: 10, skip: 1, * perf - fail: 4, pass: 63, skip: 10, * spectre-meltdown-checker-test - fail: 4, pass: 8, * ssuite - fail: 48, * v4l2-compliance - pass: 42, xfail: 2 -- Linaro QA
https://qa-reports.linaro.org
5 years, 3 months
1
0
0
0
mainline-5.4.0: regressions detected in project mainline
by Naresh Kamboju
Results from Linaro’s test farm. Regressions on arm64, arm, x86_64, and i386. The listed bpf tests failed. please find complete details below. Summary ------------------------------------------------------------------------ kernel: 5.4.0 git repo:
https://git.kernel.org/pub/scm/linux/kernel/git/torvalds/linux.git
git branch: master git commit: 386403a115f95997c2715691226e11a7b5cffcfd git describe: v5.4-3419-g386403a115f9 Test details:
https://qa-reports.linaro.org/lkft/linux-mainline-oe/build/v5.4-3419-g38640…
config:
http://snapshots.linaro.org/openembedded/lkft/lkft/sumo/intel-corei7-64/lkf…
Regressions (compared to build v5.4) ------------------------------------------------------------------------ kselftest: * bpf_test_dev_cgroup * bpf_test_skb_cgroup_id.sh * bpf_test_sysctl * bpf_test_xdp_meta.sh * bpf_test_xdp_redirect.sh * bpf_test_xdp_vlan_mode_generic.sh * bpf_test_xdp_vlan_mode_native.sh Test output log: =========== # selftests bpf test_dev_cgroup bpf: test_dev_cgroup_ # # libbpf failed to open ./dev_cgroup.o No such file or directory failed: to_open # # Failed to load DEV_CGROUP program to: load_DEV_CGROUP # [ 75.524368] IPv6: ADDRCONF(NETDEV_CHANGE): test_sock_addr1: link becomes ready [FAIL] 9 selftests bpf test_dev_cgroup # exit=1 selftests: bpf_test_dev_cgroup [FAIL] === # selftests bpf test_skb_cgroup_id.sh bpf: test_skb_cgroup_id.sh_ # # Wait for testing link-local IP to become available ... OK for: testing_link-local # # Error opening object ./test_skb_cgroup_id_kern.o No such file or directory opening: object_./test_skb_cgroup_id_kern.o # # Cannot initialize ELF context! initialize: ELF_context! # # Unable to load program to: load_program # [FAIL] 33 selftests bpf test_skb_cgroup_id.sh # exit=1 selftests: bpf_test_skb_cgroup_id.sh [FAIL] === # selftests bpf test_sysctl bpf: test_sysctl_ # # libbpf failed to open ./test_sysctl_prog.o No such file or directory failed: to_open # # (test_sysctl.c1490 errno No such file or directory) >>> Loading program (./test_sysctl_prog.o) error. errno: No_suc[ 78.078283] ip (1336) used greatest stack depth: 11144 bytes left h # # : _ # # libbpf failed to open ./test_sysctl_prog.o No such file or directory failed: to_open # # (test_sysctl.c1490 errno No such file or directory) >>> Loading program (./test_sysctl_prog.o) error. errno: No_such # # : _ # # libbpf failed to open ./test_sysctl_prog.o No such file or directory failed: to_open # # (test_sysctl.c1490 errno No such file or directory) >>> Loading program (./test_sysctl_prog.o) error. errno: No_such # ... 37: PASSED,_3 # [FAIL] 20 selftests bpf test_sysctl # exit=255 selftests: bpf_test_sysctl [FAIL] === # selftests bpf test_xdp_meta.sh bpf: test_xdp_meta.sh_ # # Error opening object test_xdp_meta.o No such file or directory opening: object_test_xdp_meta.o # # Cannot initialize ELF context! initialize: ELF_context! # # Unable to load program to: load_program # # selftests test_xdp_meta [FAILED] test_xdp_meta: [FAILED]_ # [FAIL] 26 selftests bpf test_xdp_meta.sh # exit=1 selftests: bpf_test_xdp_meta.sh [FAIL] === # selftests bpf test_xdp_redirect.sh bpf: test_xdp_redirect.sh_ # # Error opening object test_xdp_redirect.o No such file or directory opening: object_test_xdp_redirect.o # # Cannot initialize ELF context! initialize: ELF_context! # # selftests test_xdp_redirect [FAILED] test_xdp_redirect: [FAILED]_ # [FAIL] 25 selftests bpf test_xdp_redirect.sh # exit=255 selftests: bpf_test_xdp_redirect.sh [FAIL] === # selftests bpf test_xdp_vlan_mode_generic.sh bpf: test_xdp_vlan_mode_generic.sh_ # # PING 100.64.41.1 (100.64.41.1) 56(84) bytes of data. 100.64.41.1: (100.64.41.1)_56(84) # # : _ # # --- 100.64.41.1 ping statistics --- 100.64.41.1: ping_statistics # # 1 packets transmitted, 0 received, 100% packet loss, time 0ms packets: transmitted,_0 # # : _ # # Success First ping must fail First: ping_must # # Error opening object test_xdp_vlan.o No such file or directory opening: object_test_xdp_vlan.o # # Cannot initialize ELF context! initialize: ELF_context! # # selftests xdp_vlan_mode_generic [FAILED] xdp_vlan_mode_generic: [FAILED]_ # [FAIL] 35 selftests bpf test_xdp_vlan_mode_generic.sh # exit=255 selftests: bpf_test_xdp_vlan_mode_generic.sh [FAIL] === # selftests bpf test_xdp_vlan_mode_native.sh bpf: test_xdp_vlan_mode_native.sh_ # # PING 100.64.41.1 (100.64.41.1) 56(84) bytes of data. 100.64.41.1: (100.64.41.1)_56(84) # # : _ # # --- 100.64.41.1 ping statistics --- 100.64.41.1: ping_statistics # # 1 packets transmitted, 0 received, 100% packet loss, time 0ms packets: transmitted,_0 # # : _ # # Success First ping must fail First: ping_must # # Error opening object test_xdp_vlan.o No such file or directory opening: object_test_xdp_vlan.o # # Cannot initialize ELF context! initialize: ELF_context! # # selftests xdp_vlan_mode_native [FAILED] xdp_vlan_mode_native: [FAILED]_ # [FAIL] 36 selftests bpf test_xdp_vlan_mode_native.sh # exit=255 selftests: bpf_test_xdp_vlan_mode_native.sh [FAIL] Ref links:
https://lkft.validation.linaro.org/scheduler/job/1024055
Dashboard link,
https://qa-reports.linaro.org/lkft/linux-mainline-oe/tests/kselftest/bpf_te…
https://qa-reports.linaro.org/lkft/linux-mainline-oe/tests/kselftest/bpf_te…
https://qa-reports.linaro.org/lkft/linux-mainline-oe/tests/kselftest/bpf_te…
https://qa-reports.linaro.org/lkft/linux-mainline-oe/tests/kselftest/bpf_te…
https://qa-reports.linaro.org/lkft/linux-mainline-oe/tests/kselftest/bpf_te…
https://qa-reports.linaro.org/lkft/linux-mainline-oe/tests/kselftest/bpf_te…
https://qa-reports.linaro.org/lkft/linux-mainline-oe/tests/kselftest/bpf_te…
-- Linaro LKFT
https://lkft.linaro.org
5 years, 3 months
1
0
0
0
mainline 5.4.0/c2da5bdc66a3: regressions detected in project mainline on OE
by Linaro QA
Summary ------------------------------------------------------------------------ kernel: 5.4.0 git repo:
https://git.kernel.org/pub/scm/linux/kernel/git/torvalds/linux.git
git branch: master git commit: c2da5bdc66a377f0b82ee959f19f5a6774706b83 git describe: v5.4-4234-gc2da5bdc66a3 Test details:
https://qa-reports.linaro.org/lkft/linux-mainline-oe/build/v5.4-4234-gc2da5…
Regressions (compared to build v5.4-3419-g386403a115f9) ------------------------------------------------------------------------ juno-r2: kvm-unit-tests: * pmu Fixes (compared to build v5.4-3419-g386403a115f9) ------------------------------------------------------------------------ dragonboard-410c: kselftest: * memfd_run_hugetlbfs_test.sh linux-log-parser: * check-oops Boards, architectures and test suites: ------------------------------------- dragonboard-410c - arm64 * build - pass: 1, * install-android-platform-tools-r2600 - pass: 34, * kselftest - fail: 52, pass: 90, skip: 17, xfail: 40 * libgpiod - pass: 117, * libhugetlbfs - pass: 89, skip: 1, xfail: 1 * linux-log-parser - fail: 11, pass: 25, * ltp-cap_bounds-tests - pass: 1, * ltp-commands-tests - pass: 28, skip: 14, * ltp-containers-tests - pass: 80, * ltp-cpuhotplug-tests - pass: 5, skip: 1, * ltp-cve-tests - pass: 29, skip: 11, * ltp-dio-tests - pass: 10, skip: 20, * ltp-fcntl-locktests-tests - pass: 1, * ltp-filecaps-tests - pass: 1, * ltp-fs-tests - pass: 59, skip: 7, xfail: 1 * ltp-fs_bind-tests - pass: 1, * ltp-fs_perms_simple-tests - pass: 18, * ltp-fsx-tests - pass: 1, * ltp-hugetlb-tests - pass: 19, skip: 2, * ltp-io-tests - pass: 2, * ltp-ipc-tests - pass: 8, * ltp-math-tests - pass: 10, * ltp-mm-tests - pass: 54, skip: 19, xfail: 1 * ltp-nptl-tests - pass: 1, * ltp-pty-tests - pass: 4, * ltp-sched-tests - pass: 10, * ltp-securebits-tests - pass: 3, * ltp-syscalls-tests - pass: 1095, skip: 152, xfail: 3 * perf - fail: 4, pass: 56, skip: 9, xfail: 1 * spectre-meltdown-checker-test - pass: 12, * v4l2-compliance - pass: 43, xfail: 2 hi6220-hikey - arm64 * build - pass: 1, * linux-log-parser - pass: 2, i386 * build - fail: 1, * linux-log-parser - pass: 2, juno-r2 - arm64 * build - pass: 1, * kselftest - fail: 54, pass: 90, skip: 18, xfail: 39 * kvm-unit-tests - fail: 2, pass: 11, skip: 3, * libgpiod - pass: 117, * libhugetlbfs - pass: 90, skip: 1, * linux-log-parser - pass: 42, * ltp-cap_bounds-tests - pass: 1, * ltp-commands-tests - pass: 27, skip: 14, xfail: 1 * ltp-containers-tests - pass: 80, * ltp-cpuhotplug-tests - pass: 5, skip: 1, * ltp-cve-tests - pass: 29, skip: 11, * ltp-dio-tests - pass: 19, skip: 11, * ltp-fcntl-locktests-tests - pass: 1, * ltp-filecaps-tests - pass: 1, * ltp-fs-tests - pass: 59, skip: 7, xfail: 1 * ltp-fs_bind-tests - pass: 1, * ltp-fs_perms_simple-tests - pass: 18, * ltp-fsx-tests - pass: 1, * ltp-hugetlb-tests - pass: 21, * ltp-io-tests - pass: 2, * ltp-ipc-tests - pass: 8, * ltp-math-tests - pass: 10, * ltp-mm-tests - pass: 56, skip: 18, xfail: 1 * ltp-nptl-tests - pass: 1, * ltp-open-posix-tests - pass: 1693, skip: 42, xfail: 4 * ltp-pty-tests - pass: 4, * ltp-sched-tests - pass: 6, skip: 4, * ltp-securebits-tests - pass: 3, * ltp-syscalls-tests - pass: 1099, skip: 149, xfail: 2 * network-basic-tests - pass: 10, skip: 1, * perf - fail: 4, pass: 55, skip: 10, xfail: 1 * spectre-meltdown-checker-test - pass: 10, xfail: 2 * v4l2-compliance - pass: 43, xfail: 2 qemu_arm64 * kselftest - fail: 55, pass: 86, skip: 18, xfail: 41 * libgpiod - pass: 117, * libhugetlbfs - pass: 90, skip: 1, * linux-log-parser - pass: 34, * ltp-cap_bounds-tests - pass: 1, * ltp-commands-tests - pass: 28, skip: 14, * ltp-containers-tests - pass: 80, * ltp-cpuhotplug-tests - pass: 5, skip: 1, * ltp-cve-tests - pass: 29, skip: 11, * ltp-dio-tests - pass: 19, skip: 11, * ltp-fcntl-locktests-tests - pass: 1, * ltp-filecaps-tests - pass: 1, * ltp-fs-tests - pass: 59, skip: 7, xfail: 1 * ltp-fs_bind-tests - pass: 1, * ltp-fs_perms_simple-tests - pass: 18, * ltp-fsx-tests - pass: 1, * ltp-hugetlb-tests - pass: 21, * ltp-io-tests - pass: 1, xfail: 1 * ltp-ipc-tests - pass: 8, * ltp-math-tests - pass: 10, * ltp-mm-tests - pass: 56, skip: 18, xfail: 1 * ltp-nptl-tests - pass: 1, * ltp-pty-tests - pass: 4, * ltp-sched-tests - pass: 4, skip: 6, * ltp-securebits-tests - pass: 3, * ltp-syscalls-tests - fail: 2, pass: 1081, skip: 165, xfail: 2 * perf - fail: 4, pass: 56, skip: 9, xfail: 1 * spectre-meltdown-checker-test - pass: 12, * v4l2-compliance - pass: 43, xfail: 2 qemu_x86_64 * kselftest - fail: 28, pass: 120, skip: 18, xfail: 37 * libgpiod - pass: 117, * libhugetlbfs - pass: 90, skip: 1, * linux-log-parser - pass: 34, * ltp-cap_bounds-tests - pass: 1, * ltp-commands-tests - pass: 28, skip: 14, * ltp-containers-tests - pass: 80, * ltp-cpuhotplug-tests - pass: 5, skip: 1, * ltp-cve-tests - pass: 34, skip: 6, * ltp-dio-tests - pass: 19, skip: 11, * ltp-fcntl-locktests-tests - pass: 1, * ltp-filecaps-tests - pass: 1, * ltp-fs-tests - pass: 62, skip: 5, * ltp-fs_bind-tests - pass: 1, * ltp-fs_perms_simple-tests - pass: 18, * ltp-fsx-tests - pass: 1, * ltp-hugetlb-tests - pass: 21, * ltp-io-tests - pass: 1, xfail: 1 * ltp-ipc-tests - pass: 8, * ltp-math-tests - pass: 10, * ltp-mm-tests - pass: 56, skip: 18, xfail: 1 * ltp-nptl-tests - pass: 1, * ltp-pty-tests - pass: 4, * ltp-sched-tests - pass: 10, * ltp-securebits-tests - pass: 3, * ltp-syscalls-tests - pass: 1076, skip: 174, * perf - fail: 4, pass: 63, skip: 10, * spectre-meltdown-checker-test - pass: 12, * v4l2-compliance - pass: 42, xfail: 2 x15 - arm * build - fail: 1, * linux-log-parser - pass: 2, x86_64 * build - pass: 1, * kselftest - fail: 33, pass: 121, skip: 13, xfail: 36 * kselftest-vsyscall-mode-native - fail: 43, pass: 121, skip: 13, xfail: 25 * kselftest-vsyscall-mode-none - fail: 44, pass: 120, skip: 13, xfail: 26 * kvm-unit-tests - fail: 1, pass: 45, skip: 10, * libgpiod - pass: 117, * libhugetlbfs - pass: 90, skip: 1, * linux-log-parser - pass: 48, * ltp-cap_bounds-tests - pass: 1, * ltp-commands-tests - pass: 28, skip: 14, * ltp-containers-tests - pass: 80, * ltp-cpuhotplug-tests - pass: 5, skip: 1, * ltp-cve-tests - pass: 34, skip: 6, * ltp-dio-tests - pass: 19, skip: 11, * ltp-fcntl-locktests-tests - pass: 1, * ltp-filecaps-tests - pass: 1, * ltp-fs-tests - pass: 62, skip: 5, * ltp-fs_bind-tests - pass: 1, * ltp-fs_perms_simple-tests - pass: 18, * ltp-fsx-tests - pass: 1, * ltp-hugetlb-tests - pass: 21, * ltp-io-tests - pass: 2, * ltp-ipc-tests - pass: 8, * ltp-math-tests - pass: 10, * ltp-mm-tests - pass: 56, skip: 18, xfail: 1 * ltp-nptl-tests - pass: 1, * ltp-open-posix-tests - pass: 1691, skip: 42, xfail: 4 * ltp-pty-tests - pass: 4, * ltp-sched-tests - pass: 6, skip: 4, * ltp-securebits-tests - pass: 3, * ltp-syscalls-tests - pass: 1106, skip: 143, xfail: 1 * network-basic-tests - pass: 10, skip: 1, * perf - fail: 4, pass: 63, skip: 10, * spectre-meltdown-checker-test - fail: 4, pass: 8, * ssuite - fail: 28, * v4l2-compliance - pass: 42, xfail: 2 -- Linaro QA
https://qa-reports.linaro.org
5 years, 3 months
1
0
0
0
next 5.4.0/1875ff320f14: no regressions found in project next on OE - sanity
by Linaro QA
Summary ------------------------------------------------------------------------ kernel: 5.4.0 git repo:
https://git.kernel.org/pub/scm/linux/kernel/git/next/linux-next.git
git branch: master git commit: 1875ff320f14afe21731a6e4c7b46dd33e45dfaa git describe: next-20191127 Test details:
https://qa-reports.linaro.org/lkft/linux-next-oe-sanity/build/next-20191127
No regressions (compared to build next-20191126) No fixes (compared to build next-20191126) Boards, architectures and test suites: ------------------------------------- dragonboard-410c * build - pass: 1, * linux-log-parser - pass: 2, hi6220-hikey * build - pass: 1, * linux-log-parser - pass: 2, i386 * build - fail: 1, * linux-log-parser - pass: 2, juno-r2 - arm64 * build - pass: 1, * linux-log-parser - pass: 4, x15 - arm * build - fail: 1, * linux-log-parser - pass: 2, x86_64 * build - pass: 1, * linux-log-parser - pass: 4, * ltp-quickhit-tests - pass: 106, skip: 1, -- Linaro QA
https://qa-reports.linaro.org
5 years, 3 months
1
0
0
0
mainline 5.4.0/89d57dddd7d3: no regressions found in project mainline on OE - sanity
by Linaro QA
Summary ------------------------------------------------------------------------ kernel: 5.4.0 git repo:
https://git.kernel.org/pub/scm/linux/kernel/git/torvalds/linux.git
git branch: master git commit: 89d57dddd7d319ded00415790a0bb3c954b7e386 git describe: v5.4-5280-g89d57dddd7d3 Test details:
https://qa-reports.linaro.org/lkft/linux-mainline-oe-sanity/build/v5.4-5280…
No regressions (compared to build v5.4-4234-gc2da5bdc66a3) No fixes (compared to build v5.4-4234-gc2da5bdc66a3) Boards, architectures and test suites: ------------------------------------- dragonboard-410c * build - pass: 1, * linux-log-parser - pass: 2, hi6220-hikey * build - pass: 1, * linux-log-parser - pass: 2, i386 * build - fail: 1, * linux-log-parser - pass: 2, juno-r2 - arm64 * build - pass: 1, * linux-log-parser - pass: 4, * ltp-quickhit-tests - pass: 106, skip: 1, x15 - arm * build - fail: 1, * linux-log-parser - pass: 2, x86_64 * build - pass: 1, * linux-log-parser - pass: 4, * ltp-quickhit-tests - pass: 106, skip: 1, -- Linaro QA
https://qa-reports.linaro.org
5 years, 3 months
1
0
0
0
mainline 5.4.0/2be7d348fe92: no regressions found in project mainline on OE
by Linaro QA
Summary ------------------------------------------------------------------------ kernel: 5.4.0 git repo:
https://git.kernel.org/pub/scm/linux/kernel/git/torvalds/linux.git
git branch: master git commit: 2be7d348fe924f0c5583c6a805bd42cecda93104 git describe: v5.4-3800-g2be7d348fe92 Test details:
https://qa-reports.linaro.org/lkft/linux-mainline-oe/build/v5.4-3800-g2be7d…
No regressions (compared to build v5.4-3419-g386403a115f9) Fixes (compared to build v5.4-3419-g386403a115f9) ------------------------------------------------------------------------ dragonboard-410c: kselftest: * memfd_run_hugetlbfs_test.sh linux-log-parser: * check-oops Boards, architectures and test suites: ------------------------------------- dragonboard-410c - arm64 * build - pass: 1, * install-android-platform-tools-r2600 - pass: 34, * kselftest - fail: 53, pass: 90, skip: 18, xfail: 39 * libgpiod - pass: 117, * libhugetlbfs - pass: 89, skip: 1, xfail: 1 * linux-log-parser - fail: 2, pass: 34, * ltp-cap_bounds-tests - pass: 1, * ltp-commands-tests - pass: 28, skip: 14, * ltp-containers-tests - pass: 80, * ltp-cpuhotplug-tests - pass: 5, skip: 1, * ltp-cve-tests - pass: 29, skip: 11, * ltp-dio-tests - pass: 10, skip: 20, * ltp-fcntl-locktests-tests - pass: 1, * ltp-filecaps-tests - pass: 1, * ltp-fs-tests - pass: 59, skip: 7, xfail: 1 * ltp-fs_bind-tests - pass: 1, * ltp-fs_perms_simple-tests - pass: 18, * ltp-fsx-tests - pass: 1, * ltp-hugetlb-tests - pass: 19, skip: 2, * ltp-io-tests - pass: 2, * ltp-ipc-tests - pass: 8, * ltp-math-tests - pass: 10, * ltp-mm-tests - pass: 54, skip: 19, xfail: 1 * ltp-nptl-tests - pass: 1, * ltp-pty-tests - pass: 4, * ltp-sched-tests - pass: 10, * ltp-securebits-tests - pass: 3, * ltp-syscalls-tests - pass: 1096, skip: 152, xfail: 2 * perf - fail: 6, pass: 57, skip: 9, * spectre-meltdown-checker-test - pass: 12, * v4l2-compliance - pass: 43, xfail: 2 hi6220-hikey - arm64 * build - pass: 1, * linux-log-parser - pass: 2, i386 * build - fail: 1, * linux-log-parser - pass: 2, juno-r2 - arm64 * build - pass: 1, * kselftest - fail: 54, pass: 91, skip: 18, xfail: 38 * kvm-unit-tests - fail: 1, pass: 12, skip: 3, * libgpiod - pass: 117, * libhugetlbfs - pass: 90, skip: 1, * linux-log-parser - pass: 42, * ltp-cap_bounds-tests - pass: 1, * ltp-commands-tests - pass: 27, skip: 14, xfail: 1 * ltp-containers-tests - pass: 80, * ltp-cpuhotplug-tests - pass: 5, skip: 1, * ltp-cve-tests - pass: 29, skip: 11, * ltp-dio-tests - pass: 19, skip: 11, * ltp-fcntl-locktests-tests - pass: 1, * ltp-filecaps-tests - pass: 1, * ltp-fs-tests - pass: 59, skip: 7, xfail: 1 * ltp-fs_bind-tests - pass: 1, * ltp-fs_perms_simple-tests - pass: 18, * ltp-fsx-tests - pass: 1, * ltp-hugetlb-tests - pass: 21, * ltp-io-tests - pass: 2, * ltp-ipc-tests - pass: 8, * ltp-math-tests - pass: 10, * ltp-mm-tests - pass: 56, skip: 18, xfail: 1 * ltp-nptl-tests - pass: 1, * ltp-pty-tests - pass: 4, * ltp-sched-tests - pass: 6, skip: 4, * ltp-securebits-tests - pass: 3, * ltp-syscalls-tests - pass: 1099, skip: 149, xfail: 2 * network-basic-tests - pass: 10, skip: 1, * spectre-meltdown-checker-test - pass: 10, xfail: 2 * v4l2-compliance - pass: 43, xfail: 2 qemu_arm64 * kselftest - fail: 54, pass: 88, skip: 18, xfail: 40 * libgpiod - pass: 117, * libhugetlbfs - pass: 90, skip: 1, * linux-log-parser - pass: 34, * ltp-cap_bounds-tests - pass: 1, * ltp-commands-tests - pass: 28, skip: 14, * ltp-containers-tests - pass: 80, * ltp-cpuhotplug-tests - pass: 5, skip: 1, * ltp-cve-tests - pass: 29, skip: 11, * ltp-dio-tests - pass: 19, skip: 11, * ltp-fcntl-locktests-tests - pass: 1, * ltp-filecaps-tests - pass: 1, * ltp-fs-tests - pass: 59, skip: 7, xfail: 1 * ltp-fs_bind-tests - pass: 1, * ltp-fs_perms_simple-tests - pass: 18, * ltp-fsx-tests - pass: 1, * ltp-hugetlb-tests - pass: 21, * ltp-io-tests - pass: 1, xfail: 1 * ltp-ipc-tests - pass: 8, * ltp-math-tests - pass: 10, * ltp-mm-tests - pass: 56, skip: 18, xfail: 1 * ltp-nptl-tests - pass: 1, * ltp-pty-tests - pass: 4, * ltp-sched-tests - pass: 4, skip: 6, * ltp-securebits-tests - pass: 3, * ltp-syscalls-tests - fail: 2, pass: 1082, skip: 165, xfail: 1 * perf - fail: 6, pass: 56, skip: 9, xfail: 1 * spectre-meltdown-checker-test - pass: 12, * v4l2-compliance - pass: 43, xfail: 2 qemu_x86_64 * kselftest - fail: 28, pass: 121, skip: 18, xfail: 36 * libgpiod - pass: 117, * libhugetlbfs - pass: 90, skip: 1, * linux-log-parser - pass: 34, * ltp-cap_bounds-tests - pass: 1, * ltp-commands-tests - pass: 28, skip: 14, * ltp-containers-tests - pass: 80, * ltp-cpuhotplug-tests - pass: 5, skip: 1, * ltp-cve-tests - pass: 34, skip: 6, * ltp-dio-tests - pass: 19, skip: 11, * ltp-fcntl-locktests-tests - pass: 1, * ltp-filecaps-tests - pass: 1, * ltp-fs-tests - pass: 62, skip: 5, * ltp-fs_bind-tests - pass: 1, * ltp-fs_perms_simple-tests - pass: 18, * ltp-fsx-tests - pass: 1, * ltp-hugetlb-tests - pass: 21, * ltp-io-tests - pass: 1, xfail: 1 * ltp-ipc-tests - pass: 8, * ltp-math-tests - pass: 10, * ltp-mm-tests - pass: 56, skip: 18, xfail: 1 * ltp-nptl-tests - pass: 1, * ltp-pty-tests - pass: 4, * ltp-sched-tests - pass: 10, * ltp-securebits-tests - pass: 3, * ltp-syscalls-tests - pass: 1076, skip: 174, * perf - fail: 4, pass: 63, skip: 10, * spectre-meltdown-checker-test - pass: 12, * v4l2-compliance - pass: 42, xfail: 2 x15 - arm * build - fail: 1, * linux-log-parser - pass: 2, x86_64 * build - pass: 1, * kselftest - fail: 33, pass: 120, skip: 14, xfail: 37 * kselftest-vsyscall-mode-native - fail: 43, pass: 120, skip: 14, xfail: 27 * kselftest-vsyscall-mode-none - fail: 42, pass: 117, skip: 12, xfail: 27 * kvm-unit-tests - fail: 1, pass: 45, skip: 10, * libgpiod - pass: 117, * libhugetlbfs - pass: 90, skip: 1, * linux-log-parser - pass: 48, * ltp-cap_bounds-tests - pass: 1, * ltp-commands-tests - pass: 28, skip: 14, * ltp-containers-tests - pass: 80, * ltp-cpuhotplug-tests - pass: 5, skip: 1, * ltp-cve-tests - pass: 34, skip: 6, * ltp-dio-tests - pass: 19, skip: 11, * ltp-fcntl-locktests-tests - pass: 1, * ltp-filecaps-tests - pass: 1, * ltp-fs-tests - pass: 62, skip: 5, * ltp-fs_bind-tests - pass: 1, * ltp-fs_perms_simple-tests - pass: 18, * ltp-fsx-tests - pass: 1, * ltp-hugetlb-tests - pass: 21, * ltp-io-tests - pass: 2, * ltp-ipc-tests - pass: 8, * ltp-math-tests - pass: 10, * ltp-mm-tests - pass: 56, skip: 18, xfail: 1 * ltp-nptl-tests - pass: 1, * ltp-open-posix-tests - pass: 1693, skip: 42, xfail: 4 * ltp-pty-tests - pass: 4, * ltp-sched-tests - pass: 6, skip: 4, * ltp-securebits-tests - pass: 3, * ltp-syscalls-tests - pass: 1106, skip: 143, xfail: 1 * network-basic-tests - pass: 10, skip: 1, * perf - fail: 4, pass: 63, skip: 10, * spectre-meltdown-checker-test - fail: 4, pass: 8, * ssuite - fail: 24, * v4l2-compliance - pass: 42, xfail: 2 -- Linaro QA
https://qa-reports.linaro.org
5 years, 3 months
1
0
0
0
mainline 5.4.0/ab851d49f6bf: no regressions found in project mainline on OE
by Linaro QA
Summary ------------------------------------------------------------------------ kernel: 5.4.0 git repo:
https://git.kernel.org/pub/scm/linux/kernel/git/torvalds/linux.git
git branch: master git commit: ab851d49f6bfc781edd8bd44c72ec1e49211670b git describe: v5.4-3799-gab851d49f6bf Test details:
https://qa-reports.linaro.org/lkft/linux-mainline-oe/build/v5.4-3799-gab851…
No regressions (compared to build v5.4-3419-g386403a115f9) No fixes (compared to build v5.4-3419-g386403a115f9) Boards, architectures and test suites: ------------------------------------- dragonboard-410c - arm64 * build - pass: 1, * install-android-platform-tools-r2600 - pass: 34, * kselftest - fail: 54, pass: 87, skip: 18, xfail: 41 * libgpiod - pass: 117, * libhugetlbfs - pass: 89, skip: 1, xfail: 1 * linux-log-parser - fail: 3, pass: 33, * ltp-cap_bounds-tests - pass: 1, * ltp-commands-tests - pass: 27, skip: 14, xfail: 1 * ltp-containers-tests - pass: 80, * ltp-cpuhotplug-tests - pass: 5, skip: 1, * ltp-cve-tests - pass: 29, skip: 11, * ltp-dio-tests - pass: 10, skip: 20, * ltp-fcntl-locktests-tests - pass: 1, * ltp-filecaps-tests - pass: 1, * ltp-fs-tests - pass: 59, skip: 7, xfail: 1 * ltp-fs_bind-tests - pass: 1, * ltp-fs_perms_simple-tests - pass: 18, * ltp-fsx-tests - pass: 1, * ltp-hugetlb-tests - pass: 19, skip: 2, * ltp-io-tests - pass: 2, * ltp-ipc-tests - pass: 8, * ltp-math-tests - pass: 10, * ltp-mm-tests - pass: 54, skip: 19, xfail: 1 * ltp-nptl-tests - pass: 1, * ltp-pty-tests - pass: 4, * ltp-sched-tests - pass: 10, * ltp-securebits-tests - pass: 3, * perf - fail: 6, pass: 56, skip: 9, xfail: 1 * spectre-meltdown-checker-test - pass: 12, * v4l2-compliance - pass: 43, xfail: 2 hi6220-hikey - arm64 * build - pass: 1, * linux-log-parser - pass: 2, i386 * build - fail: 1, * linux-log-parser - pass: 2, juno-r2 - arm64 * build - pass: 1, * kselftest - fail: 35, pass: 23, skip: 5, xfail: 13 * kvm-unit-tests - fail: 1, pass: 12, skip: 3, * libhugetlbfs - pass: 90, skip: 1, * linux-log-parser - pass: 42, * ltp-cap_bounds-tests - pass: 1, * ltp-commands-tests - pass: 28, skip: 14, * ltp-containers-tests - pass: 80, * ltp-cpuhotplug-tests - pass: 5, skip: 1, * ltp-cve-tests - pass: 29, skip: 11, * ltp-dio-tests - pass: 19, skip: 11, * ltp-fcntl-locktests-tests - pass: 1, * ltp-filecaps-tests - pass: 1, * ltp-fs-tests - pass: 59, skip: 7, xfail: 1 * ltp-fs_bind-tests - pass: 1, * ltp-fs_perms_simple-tests - pass: 18, * ltp-fsx-tests - pass: 1, * ltp-hugetlb-tests - pass: 21, * ltp-io-tests - pass: 2, * ltp-ipc-tests - pass: 8, * ltp-math-tests - pass: 10, * ltp-mm-tests - pass: 56, skip: 18, xfail: 1 * ltp-nptl-tests - pass: 1, * ltp-open-posix-tests - pass: 1693, skip: 42, xfail: 4 * ltp-pty-tests - pass: 4, * ltp-sched-tests - pass: 6, skip: 4, * ltp-securebits-tests - pass: 3, * network-basic-tests - pass: 10, skip: 1, * spectre-meltdown-checker-test - pass: 10, xfail: 2 * v4l2-compliance - pass: 43, xfail: 2 qemu_arm64 * kselftest - fail: 55, pass: 85, skip: 18, xfail: 39 * libgpiod - pass: 117, * libhugetlbfs - pass: 90, skip: 1, * linux-log-parser - pass: 34, * ltp-cap_bounds-tests - pass: 1, * ltp-commands-tests - pass: 28, skip: 14, * ltp-containers-tests - pass: 80, * ltp-cpuhotplug-tests - pass: 5, skip: 1, * ltp-cve-tests - pass: 29, skip: 11, * ltp-dio-tests - pass: 19, skip: 11, * ltp-fcntl-locktests-tests - pass: 1, * ltp-filecaps-tests - pass: 1, * ltp-fs-tests - pass: 59, skip: 7, xfail: 1 * ltp-fs_bind-tests - pass: 1, * ltp-fs_perms_simple-tests - pass: 18, * ltp-fsx-tests - pass: 1, * ltp-hugetlb-tests - pass: 21, * ltp-io-tests - pass: 1, xfail: 1 * ltp-ipc-tests - pass: 8, * ltp-math-tests - pass: 10, * ltp-mm-tests - pass: 56, skip: 18, xfail: 1 * ltp-nptl-tests - pass: 1, * ltp-pty-tests - pass: 4, * ltp-sched-tests - pass: 4, skip: 6, * ltp-securebits-tests - pass: 3, * perf - fail: 6, pass: 56, skip: 9, xfail: 1 * spectre-meltdown-checker-test - pass: 12, * v4l2-compliance - pass: 43, xfail: 2 qemu_x86_64 * kselftest - fail: 19, pass: 34, skip: 14, xfail: 22 * libgpiod - pass: 117, * libhugetlbfs - pass: 90, skip: 1, * linux-log-parser - pass: 34, * ltp-cap_bounds-tests - pass: 1, * ltp-commands-tests - pass: 28, skip: 14, * ltp-containers-tests - pass: 80, * ltp-cpuhotplug-tests - pass: 5, skip: 1, * ltp-cve-tests - pass: 34, skip: 6, * ltp-dio-tests - pass: 19, skip: 11, * ltp-fcntl-locktests-tests - pass: 1, * ltp-filecaps-tests - pass: 1, * ltp-fs-tests - pass: 62, skip: 5, * ltp-fs_bind-tests - pass: 1, * ltp-fs_perms_simple-tests - pass: 18, * ltp-fsx-tests - pass: 1, * ltp-hugetlb-tests - pass: 21, * ltp-io-tests - pass: 1, xfail: 1 * ltp-ipc-tests - pass: 8, * ltp-math-tests - pass: 10, * ltp-mm-tests - pass: 56, skip: 18, xfail: 1 * ltp-nptl-tests - pass: 1, * ltp-pty-tests - pass: 4, * ltp-sched-tests - pass: 10, * ltp-securebits-tests - pass: 3, * perf - fail: 4, pass: 63, skip: 10, * spectre-meltdown-checker-test - pass: 12, * v4l2-compliance - pass: 42, xfail: 2 x15 - arm * build - fail: 1, * linux-log-parser - pass: 2, x86_64 * build - pass: 1, * kselftest - fail: 21, pass: 40, skip: 10, xfail: 23 * kselftest-vsyscall-mode-native - fail: 30, pass: 39, skip: 10, xfail: 14 * kvm-unit-tests - fail: 1, pass: 45, skip: 10, * libgpiod - pass: 117, * libhugetlbfs - pass: 90, skip: 1, * linux-log-parser - pass: 48, * ltp-cap_bounds-tests - pass: 1, * ltp-commands-tests - pass: 28, skip: 14, * ltp-containers-tests - pass: 80, * ltp-cpuhotplug-tests - pass: 5, skip: 1, * ltp-cve-tests - pass: 34, skip: 6, * ltp-dio-tests - pass: 19, skip: 11, * ltp-fcntl-locktests-tests - pass: 1, * ltp-filecaps-tests - pass: 1, * ltp-fs-tests - pass: 62, skip: 5, * ltp-fs_bind-tests - pass: 1, * ltp-fs_perms_simple-tests - pass: 18, * ltp-fsx-tests - pass: 1, * ltp-hugetlb-tests - pass: 21, * ltp-io-tests - pass: 2, * ltp-ipc-tests - pass: 8, * ltp-math-tests - pass: 10, * ltp-mm-tests - pass: 56, skip: 18, xfail: 1 * ltp-nptl-tests - pass: 1, * ltp-open-posix-tests - pass: 1693, skip: 42, xfail: 4 * ltp-pty-tests - pass: 4, * ltp-sched-tests - pass: 6, skip: 4, * ltp-securebits-tests - pass: 3, * network-basic-tests - pass: 10, skip: 1, * perf - fail: 4, pass: 63, skip: 10, * spectre-meltdown-checker-test - fail: 4, pass: 8, * ssuite - fail: 24, * v4l2-compliance - pass: 42, xfail: 2 -- Linaro QA
https://qa-reports.linaro.org
5 years, 3 months
1
0
0
0
mainline 5.4.0/c2da5bdc66a3: no regressions found in project mainline on OE - sanity
by Linaro QA
Summary ------------------------------------------------------------------------ kernel: 5.4.0 git repo:
https://git.kernel.org/pub/scm/linux/kernel/git/torvalds/linux.git
git branch: master git commit: c2da5bdc66a377f0b82ee959f19f5a6774706b83 git describe: v5.4-4234-gc2da5bdc66a3 Test details:
https://qa-reports.linaro.org/lkft/linux-mainline-oe-sanity/build/v5.4-4234…
No regressions (compared to build v5.4-3800-g2be7d348fe92) No fixes (compared to build v5.4-3800-g2be7d348fe92) Boards, architectures and test suites: ------------------------------------- dragonboard-410c * build - pass: 1, * linux-log-parser - pass: 2, hi6220-hikey * build - pass: 1, * linux-log-parser - pass: 2, i386 * build - fail: 1, * linux-log-parser - pass: 2, juno-r2 - arm64 * build - pass: 1, * linux-log-parser - pass: 4, * ltp-quickhit-tests - pass: 106, skip: 1, x15 - arm * build - fail: 1, * linux-log-parser - pass: 2, x86_64 * build - pass: 1, * linux-log-parser - pass: 4, * ltp-quickhit-tests - pass: 106, skip: 1, -- Linaro QA
https://qa-reports.linaro.org
5 years, 3 months
1
0
0
0
← Newer
1
...
6
7
8
9
10
11
12
...
61
Older →
Jump to page:
1
2
3
4
5
6
7
8
9
10
11
12
13
14
15
16
17
18
19
20
21
22
23
24
25
26
27
28
29
30
31
32
33
34
35
36
37
38
39
40
41
42
43
44
45
46
47
48
49
50
51
52
53
54
55
56
57
58
59
60
61
Results per page:
10
25
50
100
200