Total jobs: 123
Total errors: 13 (10.57%)
LAVA errors: 0 (0.00%)
Test errors: 0 (0.00%)
Job errors: 12 (9.76%)
Infra errors: 1 (0.81%)
Canceled jobs: 0 (0.00%)
Device type: dragonboard-410c
Total jobs: 11
Total errors: 10 (90.91%)
Error type: Job
Error count: 10 (90.91%)
Error: No match for error type 'Job', message 'Unable to update image rootfs: 'mount: mount exited with status 32: mount: /sysroot: wrong fs type, bad option, bad superblock on /dev/sda, missing codepage or helper program, or other error.\n dmesg(1) may have more information after failed mount system call.''
Count: 10 (90.91%)
IDs:
dragonboard-410c-01:
4149883 4149913 4149917 4149948 4149954
4149981 4149990 4150001 4150018 4150038
Device type: dragonboard-845c
Total jobs: 15
Total errors: 1 (6.67%)
Error type: Infrastructure
Error count: 1 (6.67%)
Error: Connection closed
Count: 1 (6.67%)
IDs:
dragonboard-845c-04:
4149947
Device type: bcm2837-rpi-3-b-32
Total jobs: 21
Total errors: 0 (0.00%)
Device type: x15
Total jobs: 33
Total errors: 2 (6.06%)
Error type: Job
Error count: 2 (6.06%)
Error: No match for error type 'Job', message 'login-action timed out after 274 seconds'
Count: 2 (6.06%)
IDs:
x15-01:
4149932 4149974
Device type: beaglebone-black
Total jobs: 41
Total errors: 0 (0.00%)
Device type: imx93-11x11-evk
Total jobs: 1
Total errors: 0 (0.00%)
Device type: hi6220-hikey-r2
Total jobs: 1
Total errors: 0 (0.00%)
Regressions on mips malta_defconfig build failed with gcc-12 on the Linux next
tag next-20250521 and next-20250522.
First seen on the next-20250521
Good: next-20250516
Bad: next-20250521
Regressions found on mips:
- build/gcc-12-malta_defconfig
Regression Analysis:
- New regression? Yes
- Reproducible? Yes
Build regression: mips gcc-12 malta_defconfig 'SOCK_COREDUMP'
undeclared (first use in this function); did you mean 'SOCK_RDM'?
Reported-by: Linux Kernel Functional Testing <lkft(a)linaro.org>
## Build log
net/unix/af_unix.c: In function 'unix_find_bsd':
net/unix/af_unix.c:1152:21: error: 'SOCK_COREDUMP' undeclared (first
use in this function); did you mean 'SOCK_RDM'?
1152 | if (flags & SOCK_COREDUMP) {
| ^~~~~~~~~~~~~
| SOCK_RDM
fs/coredump.c: In function 'do_coredump':
fs/coredump.c:899:64: error: 'SOCK_COREDUMP' undeclared (first use in
this function); did you mean 'SOCK_RDM'?
899 | addr_len, O_NONBLOCK |
SOCK_COREDUMP);
|
^~~~~~~~~~~~~
| SOCK_RDM
fs/coredump.c:899:64: note: each undeclared identifier is reported
only once for each function it appears in
make[4]: *** [scripts/Makefile.build:203: fs/coredump.o] Error 1
## Source
* Kernel version: 6.15.0-rc7
* Git tree: https://kernel.googlesource.com/pub/scm/linux/kernel/git/next/linux-next.git
* Git sha: 460178e842c7a1e48a06df684c66eb5fd630bcf7
* Git describe: next-20250522
## Build
* Build log: https://qa-reports.linaro.org/api/testruns/28516701/log_file/
* Build history:
https://qa-reports.linaro.org/lkft/linux-next-master/build/next-20250522/te…
* Build link: https://storage.tuxsuite.com/public/linaro/lkft/builds/2xRo9ld0H5IJGyGHQxUS…
* Kernel config:
https://storage.tuxsuite.com/public/linaro/lkft/builds/2xRo9ld0H5IJGyGHQxUS…
--
Linaro LKFT
https://lkft.linaro.org
Total jobs: 213
Total errors: 22 (10.33%)
LAVA errors: 0 (0.00%)
Test errors: 0 (0.00%)
Job errors: 21 (9.86%)
Infra errors: 1 (0.47%)
Canceled jobs: 0 (0.00%)
Device type: dragonboard-410c
Total jobs: 20
Total errors: 19 (95.00%)
Error type: Job
Error count: 19 (95.00%)
Error: No match for error type 'Job', message 'Unable to update image rootfs: 'mount: mount exited with status 32: mount: /sysroot: wrong fs type, bad option, bad superblock on /dev/sda, missing codepage or helper program, or other error.\n dmesg(1) may have more information after failed mount system call.''
Count: 19 (95.00%)
IDs:
dragonboard-410c-01:
4149572 4149586 4149625 4149629 4149648
4149658 4149676 4149700 4149715 4149730
4149830 4149833 4149840 4149843 4149850
4149855 4149859 4149861 4149865
Device type: dragonboard-845c
Total jobs: 23
Total errors: 2 (8.70%)
Error type: Job
Error count: 1 (4.35%)
Error: No match for error type 'Job', message '[ 0.000000] Kernel panic - not syncing: Attempted to kill the idle task!
[ 0.000000] ---[ end Kernel panic - not syncing: Attempted to kill the idle task! ]---'
Count: 1 (4.35%)
IDs:
dragonboard-845c-08:
4149852
Error type: Infrastructure
Error count: 1 (4.35%)
Error: Connection closed
Count: 1 (4.35%)
IDs:
dragonboard-845c-05:
4149660
Device type: x15
Total jobs: 57
Total errors: 1 (1.75%)
Error type: Job
Error count: 1 (1.75%)
Error: No match for error type 'Job', message 'login-action timed out after 274 seconds'
Count: 1 (1.75%)
IDs:
x15-01:
4149814
Device type: beaglebone-black
Total jobs: 74
Total errors: 0 (0.00%)
Device type: bcm2837-rpi-3-b-32
Total jobs: 37
Total errors: 0 (0.00%)
Device type: imx93-11x11-evk
Total jobs: 1
Total errors: 0 (0.00%)
Device type: hi6220-hikey-r2
Total jobs: 1
Total errors: 0 (0.00%)
Regressions on arm64 defconfig build failed with gcc-8 on the Linux next
tag next-20250512 and next-20250522.
First seen on the next-20250512
Good: next-20250509
Bad: next-20250512
Regressions found on arm64:
- build/gcc-8-defconfig
Regression Analysis:
- New regression? Yes
- Reproducible? Yes
Build regression: arm64 gcc-8 defconfig call to '__field_overflow'
declared with attribute error value doesn't fit into mask
Reported-by: Linux Kernel Functional Testing <lkft(a)linaro.org>
## Build log
-----
In file included from arch/arm64/include/asm/sysreg.h:1107,
from arch/arm64/include/asm/cputype.h:248,
from arch/arm64/include/asm/cache.h:43,
from include/vdso/cache.h:5,
from include/linux/cache.h:6,
from include/linux/time.h:5,
from include/linux/skbuff.h:15,
from include/linux/if_ether.h:19,
from include/linux/ieee80211.h:19,
from drivers/net/wireless/intel/iwlwifi/iwl-trans.h:10,
from drivers/net/wireless/intel/iwlwifi/pcie/ctxt-info.c:6:
In function 'u32_encode_bits',
inlined from 'iwl_pcie_ctxt_info_init' at
drivers/net/wireless/intel/iwlwifi/pcie/ctxt-info.c:208:3:
include/linux/bitfield.h:195:3: error: call to '__field_overflow'
declared with attribute error: value doesn't fit into mask
__field_overflow(); \
^~~~~~~~~~~~~~~~~~
include/linux/bitfield.h:215:2: note: in expansion of macro '____MAKE_OP'
____MAKE_OP(u##size,u##size,,)
^~~~~~~~~~~
include/linux/bitfield.h:218:1: note: in expansion of macro '__MAKE_OP'
__MAKE_OP(32)
^~~~~~~~~
## Source
* Kernel version: 6.15.0-rc7
* Git tree: https://kernel.googlesource.com/pub/scm/linux/kernel/git/next/linux-next.git
* Git sha: 460178e842c7a1e48a06df684c66eb5fd630bcf7
* Git describe: next-20250522
## Build
* Build log: https://qa-reports.linaro.org/api/testruns/28517069/log_file/
* Build history:
https://qa-reports.linaro.org/lkft/linux-next-master/build/next-20250522/te…
* Build link: https://storage.tuxsuite.com/public/linaro/lkft/builds/2xRo9LbWebbQqL9EYIT8…
* Kernel config:
https://storage.tuxsuite.com/public/linaro/lkft/builds/2xRo9LbWebbQqL9EYIT8…
--
Linaro LKFT
https://lkft.linaro.org
Currently rust on arm fails to compile due to '-mno-fdpic'. This flag
disables a GCC feature that we don't want for kernel builds, so let's
skip it.
Reported-by: Linux Kernel Functional Testing <lkft(a)linaro.org>
Closes: https://lore.kernel.org/all/CA+G9fYvOanQBYXKSg7C6EU30k8sTRC0JRPJXYu7wWK51w3…
Signed-off-by: Miguel Ojeda <ojeda(a)kernel.org>
Tested-by: Naresh Kamboju <naresh.kamboju(a)linaro.org>
Signed-off-by: Naresh Kamboju <naresh.kamboju(a)linaro.org>
Tested-by: Rudraksha Gupta <guptarud(a)gmail.com>
Signed-off-by: Rudraksha Gupta <guptarud(a)gmail.com>
---
Currently rust on arm fails to compile due to '-mno-fdpic'. This flag
disables a GCC feature that we don't want for kernel builds, so let's
skip it.
It seems like this bug went through the cracks, so I went ahead and sent
it. Hopefully nobody minds.
Closes: https://lore.kernel.org/all/CA+G9fYvOanQBYXKSg7C6EU30k8sTRC0JRPJXYu7wWK51w3…
---
rust/Makefile | 2 +-
1 file changed, 1 insertion(+), 1 deletion(-)
diff --git a/rust/Makefile b/rust/Makefile
index 3aca903a7d08..f207ba0ed466 100644
--- a/rust/Makefile
+++ b/rust/Makefile
@@ -273,7 +273,7 @@ bindgen_skip_c_flags := -mno-fp-ret-in-387 -mpreferred-stack-boundary=% \
-fzero-call-used-regs=% -fno-stack-clash-protection \
-fno-inline-functions-called-once -fsanitize=bounds-strict \
-fstrict-flex-arrays=% -fmin-function-alignment=% \
- -fzero-init-padding-bits=% \
+ -fzero-init-padding-bits=% -mno-fdpic \
--param=% --param asan-%
# Derived from `scripts/Makefile.clang`.
---
base-commit: a5806cd506af5a7c19bcd596e4708b5c464bfd21
change-id: 20250520-rust-mno-fdpic-arm-fix-940a58bf9433
Best regards,
--
Rudraksha Gupta <guptarud(a)gmail.com>