Am 13.10.2026 um 21:19 schrieb Florian Fainelli:
On 10/13/26 06:13, Pavel Machek wrote:
On Tue 2026-10-13 12:29:12, Brett A C Sheffield wrote:
On 2026-10-13 13:29, Greg Kroah-Hartman wrote:
This is the start of the stable review cycle for the 6.18.57 release. There are 621 patches in this series, all will be posted as a response to this one. If anyone has any issues with these being applied, please let me know.
Responses should be made by Thu, 15 Oct 2026 11:28:22 +0000. Anything received after that time might be too late.
Build failing on amd64:
/usr/x86_64-pc-linux-gnu/binutils-bin/2.47/ld: vmlinux.o: in function `gss_krb5_get_mic_v2': (.text+0xfc2762): undefined reference to `crypto_krb5_get_mic' /usr/x86_64-pc-linux-gnu/binutils-bin/2.47/ld: vmlinux.o: in function `gss_krb5_verify_mic_v2': (.text+0xfc293a): undefined reference to `crypto_krb5_verify_mic' /usr/x86_64-pc-linux-gnu/binutils-bin/2.47/ld: vmlinux.o: in function `gss_krb5_aead_encrypt': (.text+0xfc47a1): undefined reference to `crypto_krb5_encrypt' /usr/x86_64-pc-linux-gnu/binutils-bin/2.47/ld: vmlinux.o: in function `gss_krb5_aead_decrypt': (.text+0xfc48f8): undefined reference to `crypto_krb5_decrypt' make[2]: *** [scripts/Makefile.vmlinux:72: vmlinux.unstripped] Error 1 make[1]: *** [/usr/src/linux-stable-rc/Makefile:1272: vmlinux] Error 2 make: *** [Makefile:248: __sub-make] Error 2
We see same problem here:
https://gitlab.com/cip-project/cip-testing/linux-stable-rc-ci/-/jobs/1713911...
And here as well.
Strangely, my build succeeded, and it booted, too. I built, as usual, on my 2-socket Ivy Bridge Xeon E5-2697v2 server, with "make olddefconfig" based on the config of the Proxmox VE kernel 6.17.13-21-pve. Also my dmesg output shows in the last lines:
[ 101.288430] krb5: [ 101.288434] krb5: Running selftests [ 101.288435] krb5: Running aes128-cts-hmac-sha256-128 prf [ 101.288445] krb5: Running aes256-cts-hmac-sha384-192 prf [ 101.288452] krb5: Running aes128-cts-hmac-sha256-128 key [ 101.288460] krb5: Running aes256-cts-hmac-sha384-192 key [ 101.288469] krb5: Running camellia128-cts-cmac key [ 101.316448] AVX2 or AES-NI instructions are not detected. [ 101.359071] krb5: Running camellia256-cts-cmac key [ 101.359084] krb5: Running aes128-cts-hmac-sha256-128 enc no plain [ 101.372528] krb5: Running aes128-cts-hmac-sha256-128 enc plain<block [ 101.372540] krb5: Running aes128-cts-hmac-sha256-128 enc plain==block [ 101.372547] krb5: Running aes128-cts-hmac-sha256-128 enc plain>block [ 101.372555] krb5: Running aes256-cts-hmac-sha384-192 enc no plain [ 101.377075] krb5: Running aes256-cts-hmac-sha384-192 enc plain<block [ 101.377088] krb5: Running aes256-cts-hmac-sha384-192 enc plain==block [ 101.377098] krb5: Running aes256-cts-hmac-sha384-192 enc plain>block [ 101.377107] krb5: Running camellia128-cts-cmac enc no plain [ 101.394163] krb5: Running camellia128-cts-cmac enc 1 plain [ 101.394179] krb5: Running camellia128-cts-cmac enc 9 plain [ 101.394190] krb5: Running camellia128-cts-cmac enc 13 plain [ 101.394200] krb5: Running camellia128-cts-cmac enc 30 plain [ 101.394212] krb5: Running camellia256-cts-cmac enc no plain [ 101.394223] krb5: Running camellia256-cts-cmac enc 1 plain [ 101.394235] krb5: Running camellia256-cts-cmac enc 9 plain [ 101.394247] krb5: Running camellia256-cts-cmac enc 13 plain [ 101.394259] krb5: Running camellia256-cts-cmac enc 30 plain [ 101.394272] krb5: Running aes128-cts-hmac-sha256-128 mic [ 101.394282] krb5: Running aes256-cts-hmac-sha384-192 mic [ 101.394290] krb5: Running camellia128-cts-cmac mic abc [ 101.394297] krb5: Running camellia128-cts-cmac mic ABC [ 101.394303] krb5: Running camellia256-cts-cmac mic 123 [ 101.394310] krb5: Running camellia256-cts-cmac mic !@# [ 101.394317] krb5: Selftests succeeded
so everything seems to be fine on my machine.
I wonder what triggered the build error for the other folks who encountered it? I'll attach my .config in case anyone wants to compare with theirs where the build failed.
Beste Grüße, Peter Schneider