lists.linaro.org
Sign In
Sign Up
Sign In
Sign Up
Manage this list
×
Keyboard Shortcuts
Thread View
j
: Next unread message
k
: Previous unread message
j a
: Jump to all threads
j l
: Jump to MailingList overview
2025
April
March
February
January
2024
December
November
October
September
August
July
June
May
April
March
February
January
2023
December
November
October
September
August
July
June
May
April
March
February
January
2022
December
November
October
September
August
July
June
May
April
March
February
January
2021
December
November
October
September
August
July
June
May
April
March
February
January
2020
December
November
October
September
August
July
June
May
April
March
February
January
2019
December
November
October
September
August
July
June
May
April
March
February
January
2018
December
November
October
September
August
July
June
May
April
March
February
January
2017
December
November
October
September
August
July
June
May
April
March
February
January
2016
December
November
October
September
August
July
June
May
April
March
February
January
2015
December
November
October
September
August
July
June
May
April
March
February
January
2014
December
November
October
September
August
July
June
May
April
March
February
January
2013
December
November
October
September
August
List overview
Download
Kernel-build-reports
March 2022
----- 2025 -----
April 2025
March 2025
February 2025
January 2025
----- 2024 -----
December 2024
November 2024
October 2024
September 2024
August 2024
July 2024
June 2024
May 2024
April 2024
March 2024
February 2024
January 2024
----- 2023 -----
December 2023
November 2023
October 2023
September 2023
August 2023
July 2023
June 2023
May 2023
April 2023
March 2023
February 2023
January 2023
----- 2022 -----
December 2022
November 2022
October 2022
September 2022
August 2022
July 2022
June 2022
May 2022
April 2022
March 2022
February 2022
January 2022
----- 2021 -----
December 2021
November 2021
October 2021
September 2021
August 2021
July 2021
June 2021
May 2021
April 2021
March 2021
February 2021
January 2021
----- 2020 -----
December 2020
November 2020
October 2020
September 2020
August 2020
July 2020
June 2020
May 2020
April 2020
March 2020
February 2020
January 2020
----- 2019 -----
December 2019
November 2019
October 2019
September 2019
August 2019
July 2019
June 2019
May 2019
April 2019
March 2019
February 2019
January 2019
----- 2018 -----
December 2018
November 2018
October 2018
September 2018
August 2018
July 2018
June 2018
May 2018
April 2018
March 2018
February 2018
January 2018
----- 2017 -----
December 2017
November 2017
October 2017
September 2017
August 2017
July 2017
June 2017
May 2017
April 2017
March 2017
February 2017
January 2017
----- 2016 -----
December 2016
November 2016
October 2016
September 2016
August 2016
July 2016
June 2016
May 2016
April 2016
March 2016
February 2016
January 2016
----- 2015 -----
December 2015
November 2015
October 2015
September 2015
August 2015
July 2015
June 2015
May 2015
April 2015
March 2015
February 2015
January 2015
----- 2014 -----
December 2014
November 2014
October 2014
September 2014
August 2014
July 2014
June 2014
May 2014
April 2014
March 2014
February 2014
January 2014
----- 2013 -----
December 2013
November 2013
October 2013
September 2013
August 2013
kernel-build-reports@lists.linaro.org
7 participants
979 discussions
Start a n
N
ew thread
cip/linux-4.19.y-cip ltp-timers: 6 runs, 2 regressions (v4.19.235-cip70)
by kernelci.org bot
cip/linux-4.19.y-cip ltp-timers: 6 runs, 2 regressions (v4.19.235-cip70) Regressions Summary ------------------- platform | arch | lab | compiler | defconfig | regressions -------------------+--------+---------------+----------+------------------------------+------------ hp-11A-G6-EE-grunt | x86_64 | lab-collabora | gcc-10 | x86_64_defcon...6-chromebook | 2 Details:
https://kernelci.org/test/job/cip/branch/linux-4.19.y-cip/kernel/v4.19.235-…
Test: ltp-timers Tree: cip Branch: linux-4.19.y-cip Describe: v4.19.235-cip70 URL:
https://git.kernel.org/pub/scm/linux/kernel/git/cip/linux-cip.git
SHA: 91567a6adc2cb5217b6d7aabf7da3ac9ae6f1a79 Test suite revisions: ltp-tests URL:
https://github.com/linux-test-project/ltp.git
SHA: dc836ec4cd4e02e1346001f828c1f1988a8d7d54 Test Regressions ---------------- platform | arch | lab | compiler | defconfig | regressions -------------------+--------+---------------+----------+------------------------------+------------ hp-11A-G6-EE-grunt | x86_64 | lab-collabora | gcc-10 | x86_64_defcon...6-chromebook | 2 Details:
https://kernelci.org/test/plan/id/6242dd9267b43ebba7ae0696
Results: 32 PASS, 4 FAIL, 0 SKIP Full config: x86_64_defconfig+x86-chromebook Compiler: gcc-10 (gcc (Debian 10.2.1-6) 10.2.1 20210110) Plain log:
https://storage.kernelci.org//cip/linux-4.19.y-cip/v4.19.235-cip70/x86_64/x…
HTML log:
https://storage.kernelci.org//cip/linux-4.19.y-cip/v4.19.235-cip70/x86_64/x…
Rootfs:
http://storage.kernelci.org/images/rootfs/debian/bullseye-ltp/20220311.1/am…
* ltp-timers.clock_settime:
https://kernelci.org/test/case/id/6242dd9267b43ebba7ae06a6
new failure (last pass: v4.19.233-cip69) * ltp-timers.clock_settime:
https://kernelci.org/test/case/id/6242dd9267b43ebba7ae06a6
new failure (last pass: v4.19.233-cip69)
3 years
1
0
0
0
cip/linux-4.19.y-cip ltp-pty: 3 runs, 3 regressions (v4.19.235-cip70)
by kernelci.org bot
cip/linux-4.19.y-cip ltp-pty: 3 runs, 3 regressions (v4.19.235-cip70) Regressions Summary ------------------- platform | arch | lab | compiler | defconfig | regressions --------------------------+--------+---------------+----------+------------------------------+------------ asus-C433TA-AJ0005-rammus | x86_64 | lab-collabora | gcc-10 | x86_64_defcon...6-chromebook | 1 hp-11A-G6-EE-grunt | x86_64 | lab-collabora | gcc-10 | x86_64_defcon...6-chromebook | 1 rk3399-gru-kevin | arm64 | lab-collabora | gcc-10 | defconfig+arm64-chromebook | 1 Details:
https://kernelci.org/test/job/cip/branch/linux-4.19.y-cip/kernel/v4.19.235-…
Test: ltp-pty Tree: cip Branch: linux-4.19.y-cip Describe: v4.19.235-cip70 URL:
https://git.kernel.org/pub/scm/linux/kernel/git/cip/linux-cip.git
SHA: 91567a6adc2cb5217b6d7aabf7da3ac9ae6f1a79 Test suite revisions: ltp-tests URL:
https://github.com/linux-test-project/ltp.git
SHA: dc836ec4cd4e02e1346001f828c1f1988a8d7d54 Test Regressions ---------------- platform | arch | lab | compiler | defconfig | regressions --------------------------+--------+---------------+----------+------------------------------+------------ asus-C433TA-AJ0005-rammus | x86_64 | lab-collabora | gcc-10 | x86_64_defcon...6-chromebook | 1 Details:
https://kernelci.org/test/plan/id/6242da926f5f446e37ae0687
Results: 0 PASS, 1 FAIL, 0 SKIP Full config: x86_64_defconfig+x86-chromebook Compiler: gcc-10 (gcc (Debian 10.2.1-6) 10.2.1 20210110) Plain log:
https://storage.kernelci.org//cip/linux-4.19.y-cip/v4.19.235-cip70/x86_64/x…
HTML log:
https://storage.kernelci.org//cip/linux-4.19.y-cip/v4.19.235-cip70/x86_64/x…
Rootfs:
http://storage.kernelci.org/images/rootfs/debian/bullseye-ltp/20220311.1/am…
* ltp-pty.login:
https://kernelci.org/test/case/id/6242da926f5f446e37ae0688
new failure (last pass: v4.19.233-cip69) platform | arch | lab | compiler | defconfig | regressions --------------------------+--------+---------------+----------+------------------------------+------------ hp-11A-G6-EE-grunt | x86_64 | lab-collabora | gcc-10 | x86_64_defcon...6-chromebook | 1 Details:
https://kernelci.org/test/plan/id/6242ded291b74ccf79ae067c
Results: 0 PASS, 1 FAIL, 0 SKIP Full config: x86_64_defconfig+x86-chromebook Compiler: gcc-10 (gcc (Debian 10.2.1-6) 10.2.1 20210110) Plain log:
https://storage.kernelci.org//cip/linux-4.19.y-cip/v4.19.235-cip70/x86_64/x…
HTML log:
https://storage.kernelci.org//cip/linux-4.19.y-cip/v4.19.235-cip70/x86_64/x…
Rootfs:
http://storage.kernelci.org/images/rootfs/debian/bullseye-ltp/20220311.1/am…
* ltp-pty.login:
https://kernelci.org/test/case/id/6242ded291b74ccf79ae067d
new failure (last pass: v4.19.233-cip69) platform | arch | lab | compiler | defconfig | regressions --------------------------+--------+---------------+----------+------------------------------+------------ rk3399-gru-kevin | arm64 | lab-collabora | gcc-10 | defconfig+arm64-chromebook | 1 Details:
https://kernelci.org/test/plan/id/6242db3b721c4ffc31ae068d
Results: 0 PASS, 1 FAIL, 0 SKIP Full config: defconfig+arm64-chromebook Compiler: gcc-10 (aarch64-linux-gnu-gcc (Debian 10.2.1-6) 10.2.1 20210110) Plain log:
https://storage.kernelci.org//cip/linux-4.19.y-cip/v4.19.235-cip70/arm64/de…
HTML log:
https://storage.kernelci.org//cip/linux-4.19.y-cip/v4.19.235-cip70/arm64/de…
Rootfs:
http://storage.kernelci.org/images/rootfs/debian/bullseye-ltp/20220311.1/ar…
* ltp-pty.login:
https://kernelci.org/test/case/id/6242db3b721c4ffc31ae068e
new failure (last pass: v4.19.229-cip67)
3 years
1
0
0
0
cip/linux-4.19.y-cip ltp-fcntl-locktests: 3 runs, 1 regressions (v4.19.235-cip70)
by kernelci.org bot
cip/linux-4.19.y-cip ltp-fcntl-locktests: 3 runs, 1 regressions (v4.19.235-cip70) Regressions Summary ------------------- platform | arch | lab | compiler | defconfig | regressions -----------------+-------+---------------+----------+----------------------------+------------ rk3399-gru-kevin | arm64 | lab-collabora | gcc-10 | defconfig+arm64-chromebook | 1 Details:
https://kernelci.org/test/job/cip/branch/linux-4.19.y-cip/kernel/v4.19.235-…
Test: ltp-fcntl-locktests Tree: cip Branch: linux-4.19.y-cip Describe: v4.19.235-cip70 URL:
https://git.kernel.org/pub/scm/linux/kernel/git/cip/linux-cip.git
SHA: 91567a6adc2cb5217b6d7aabf7da3ac9ae6f1a79 Test suite revisions: ltp-tests URL:
https://github.com/linux-test-project/ltp.git
SHA: dc836ec4cd4e02e1346001f828c1f1988a8d7d54 Test Regressions ---------------- platform | arch | lab | compiler | defconfig | regressions -----------------+-------+---------------+----------+----------------------------+------------ rk3399-gru-kevin | arm64 | lab-collabora | gcc-10 | defconfig+arm64-chromebook | 1 Details:
https://kernelci.org/test/plan/id/6242d793a1ae15b33eae068d
Results: 0 PASS, 1 FAIL, 0 SKIP Full config: defconfig+arm64-chromebook Compiler: gcc-10 (aarch64-linux-gnu-gcc (Debian 10.2.1-6) 10.2.1 20210110) Plain log:
https://storage.kernelci.org//cip/linux-4.19.y-cip/v4.19.235-cip70/arm64/de…
HTML log:
https://storage.kernelci.org//cip/linux-4.19.y-cip/v4.19.235-cip70/arm64/de…
Rootfs:
http://storage.kernelci.org/images/rootfs/debian/bullseye-ltp/20220311.1/ar…
* ltp-fcntl-locktests.login:
https://kernelci.org/test/case/id/6242d793a1ae15b33eae068e
new failure (last pass: v4.19.229-cip67)
3 years
1
0
0
0
cip/linux-5.10.y-cip build: 190 builds: 3 failed, 187 passed, 4 errors, 10 warnings (v5.10.106-cip4)
by kernelci.org bot
cip/linux-5.10.y-cip build: 190 builds: 3 failed, 187 passed, 4 errors, 10 warnings (v5.10.106-cip4) Full Build Summary:
https://kernelci.org/build/cip/branch/linux-5.10.y-cip/kernel/v5.10.106-cip…
Tree: cip Branch: linux-5.10.y-cip Git Describe: v5.10.106-cip4 Git Commit: 8bb6e30b765989a3c0924158316d689e16317cd1 Git URL:
https://git.kernel.org/pub/scm/linux/kernel/git/cip/linux-cip.git
Built: 7 unique architectures Build Failures Detected: arm: rpc_defconfig: (gcc-10) FAIL mips: ip27_defconfig: (gcc-10) FAIL ip28_defconfig: (gcc-10) FAIL Errors and Warnings Detected: arc: arm64: arm: rpc_defconfig (gcc-10): 4 errors i386: mips: 32r2el_defconfig (gcc-10): 1 warning decstation_64_defconfig (gcc-10): 1 warning decstation_defconfig (gcc-10): 1 warning decstation_r4k_defconfig (gcc-10): 1 warning lemote2f_defconfig (gcc-10): 1 warning rm200_defconfig (gcc-10): 1 warning riscv: rv32_defconfig (gcc-10): 4 warnings x86_64: Errors summary: 2 arm-linux-gnueabihf-gcc: error: unrecognized -march target: armv3m 2 arm-linux-gnueabihf-gcc: error: missing argument to ‘-march=’ Warnings summary: 3 kernel/rcu/tasks.h:707:13: warning: ‘show_rcu_tasks_rude_gp_kthread’ defined but not used [-Wunused-function] 2 WARNING: modpost: Symbol info of vmlinux is missing. Unresolved symbol check will be entirely skipped. 2 <stdin>:830:2: warning: #warning syscall fstat64 not implemented [-Wcpp] 2 <stdin>:1127:2: warning: #warning syscall fstatat64 not implemented [-Wcpp] 1 net/mac80211/mlme.c:4343:1: warning: the frame size of 1040 bytes is larger than 1024 bytes [-Wframe-larger-than=] 1 drivers/block/paride/bpck.c:32: warning: "PC" redefined Section mismatches summary: 1 WARNING: modpost: vmlinux.o(.text+0xd040): Section mismatch in reference from the function __arm_ioremap_pfn_caller() to the function .meminit.text:memblock_is_map_memory() 1 WARNING: modpost: vmlinux.o(.text+0xce9c): Section mismatch in reference from the function __arm_ioremap_pfn_caller() to the function .meminit.text:memblock_is_map_memory() 1 WARNING: modpost: vmlinux.o(.text+0xcda4): Section mismatch in reference from the function __arm_ioremap_pfn_caller() to the function .meminit.text:memblock_is_map_memory() 1 WARNING: modpost: vmlinux.o(.text+0xcd38): Section mismatch in reference from the function __arm_ioremap_pfn_caller() to the function .meminit.text:memblock_is_map_memory() 1 WARNING: modpost: vmlinux.o(.text+0xcb84): Section mismatch in reference from the function __arm_ioremap_pfn_caller() to the function .meminit.text:memblock_is_map_memory() 1 WARNING: modpost: vmlinux.o(.text+0xcb74): Section mismatch in reference from the function __arm_ioremap_pfn_caller() to the function .meminit.text:memblock_is_map_memory() 1 WARNING: modpost: vmlinux.o(.text+0xcb6c): Section mismatch in reference from the function __arm_ioremap_pfn_caller() to the function .meminit.text:memblock_is_map_memory() 1 WARNING: modpost: vmlinux.o(.text+0xcb4c): Section mismatch in reference from the function __arm_ioremap_pfn_caller() to the function .meminit.text:memblock_is_map_memory() 1 WARNING: modpost: vmlinux.o(.text+0xcaa8): Section mismatch in reference from the function __arm_ioremap_pfn_caller() to the function .meminit.text:memblock_is_map_memory() 1 WARNING: modpost: vmlinux.o(.text+0xc8ec): Section mismatch in reference from the function __arm_ioremap_pfn_caller() to the function .meminit.text:memblock_is_map_memory() 1 WARNING: modpost: vmlinux.o(.text+0xb904): Section mismatch in reference from the function __arm_ioremap_pfn_caller() to the function .meminit.text:memblock_is_map_memory() 1 WARNING: modpost: vmlinux.o(.text+0x8054): Section mismatch in reference from the function __arm_ioremap_pfn_caller() to the function .meminit.text:memblock_is_map_memory() 1 WARNING: modpost: vmlinux.o(.text+0x7670): Section mismatch in reference from the function __arm_ioremap_pfn_caller() to the function .meminit.text:memblock_is_map_memory() ================================================================================ Detailed per-defconfig build reports: -------------------------------------------------------------------------------- 32r2el_defconfig (mips, gcc-10) — PASS, 0 errors, 1 warning, 0 section mismatches Warnings: WARNING: modpost: Symbol info of vmlinux is missing. Unresolved symbol check will be entirely skipped. -------------------------------------------------------------------------------- allnoconfig (arc, gcc-10) — PASS, 0 errors, 0 warnings, 0 section mismatches -------------------------------------------------------------------------------- allnoconfig (i386, gcc-10) — PASS, 0 errors, 0 warnings, 0 section mismatches -------------------------------------------------------------------------------- allnoconfig (x86_64, gcc-10) — PASS, 0 errors, 0 warnings, 0 section mismatches -------------------------------------------------------------------------------- am200epdkit_defconfig (arm, gcc-10) — PASS, 0 errors, 0 warnings, 0 section mismatches -------------------------------------------------------------------------------- ar7_defconfig (mips, gcc-10) — PASS, 0 errors, 0 warnings, 0 section mismatches -------------------------------------------------------------------------------- aspeed_g4_defconfig (arm, gcc-10) — PASS, 0 errors, 0 warnings, 0 section mismatches -------------------------------------------------------------------------------- aspeed_g5_defconfig (arm, gcc-10) — PASS, 0 errors, 0 warnings, 0 section mismatches -------------------------------------------------------------------------------- assabet_defconfig (arm, gcc-10) — PASS, 0 errors, 0 warnings, 0 section mismatches Section mismatches: WARNING: modpost: vmlinux.o(.text+0xcb6c): Section mismatch in reference from the function __arm_ioremap_pfn_caller() to the function .meminit.text:memblock_is_map_memory() -------------------------------------------------------------------------------- at91_dt_defconfig (arm, gcc-10) — PASS, 0 errors, 0 warnings, 0 section mismatches -------------------------------------------------------------------------------- ath25_defconfig (mips, gcc-10) — PASS, 0 errors, 0 warnings, 0 section mismatches -------------------------------------------------------------------------------- ath79_defconfig (mips, gcc-10) — PASS, 0 errors, 0 warnings, 0 section mismatches -------------------------------------------------------------------------------- axm55xx_defconfig (arm, gcc-10) — PASS, 0 errors, 0 warnings, 0 section mismatches -------------------------------------------------------------------------------- axs103_defconfig (arc, gcc-10) — PASS, 0 errors, 0 warnings, 0 section mismatches -------------------------------------------------------------------------------- axs103_smp_defconfig (arc, gcc-10) — PASS, 0 errors, 0 warnings, 0 section mismatches -------------------------------------------------------------------------------- badge4_defconfig (arm, gcc-10) — PASS, 0 errors, 0 warnings, 0 section mismatches Section mismatches: WARNING: modpost: vmlinux.o(.text+0xcd38): Section mismatch in reference from the function __arm_ioremap_pfn_caller() to the function .meminit.text:memblock_is_map_memory() -------------------------------------------------------------------------------- bcm2835_defconfig (arm, gcc-10) — PASS, 0 errors, 0 warnings, 0 section mismatches -------------------------------------------------------------------------------- bcm47xx_defconfig (mips, gcc-10) — PASS, 0 errors, 0 warnings, 0 section mismatches -------------------------------------------------------------------------------- bcm63xx_defconfig (mips, gcc-10) — PASS, 0 errors, 0 warnings, 0 section mismatches -------------------------------------------------------------------------------- bigsur_defconfig (mips, gcc-10) — PASS, 0 errors, 0 warnings, 0 section mismatches -------------------------------------------------------------------------------- bmips_be_defconfig (mips, gcc-10) — PASS, 0 errors, 0 warnings, 0 section mismatches -------------------------------------------------------------------------------- bmips_stb_defconfig (mips, gcc-10) — PASS, 0 errors, 0 warnings, 0 section mismatches -------------------------------------------------------------------------------- capcella_defconfig (mips, gcc-10) — PASS, 0 errors, 0 warnings, 0 section mismatches -------------------------------------------------------------------------------- cavium_octeon_defconfig (mips, gcc-10) — PASS, 0 errors, 0 warnings, 0 section mismatches -------------------------------------------------------------------------------- cerfcube_defconfig (arm, gcc-10) — PASS, 0 errors, 0 warnings, 0 section mismatches Section mismatches: WARNING: modpost: vmlinux.o(.text+0x7670): Section mismatch in reference from the function __arm_ioremap_pfn_caller() to the function .meminit.text:memblock_is_map_memory() -------------------------------------------------------------------------------- ci20_defconfig (mips, gcc-10) — PASS, 0 errors, 0 warnings, 0 section mismatches -------------------------------------------------------------------------------- cm_x300_defconfig (arm, gcc-10) — PASS, 0 errors, 0 warnings, 0 section mismatches -------------------------------------------------------------------------------- cobalt_defconfig (mips, gcc-10) — PASS, 0 errors, 0 warnings, 0 section mismatches -------------------------------------------------------------------------------- colibri_pxa270_defconfig (arm, gcc-10) — PASS, 0 errors, 0 warnings, 0 section mismatches -------------------------------------------------------------------------------- colibri_pxa300_defconfig (arm, gcc-10) — PASS, 0 errors, 0 warnings, 0 section mismatches -------------------------------------------------------------------------------- collie_defconfig (arm, gcc-10) — PASS, 0 errors, 0 warnings, 0 section mismatches Section mismatches: WARNING: modpost: vmlinux.o(.text+0xb904): Section mismatch in reference from the function __arm_ioremap_pfn_caller() to the function .meminit.text:memblock_is_map_memory() -------------------------------------------------------------------------------- corgi_defconfig (arm, gcc-10) — PASS, 0 errors, 0 warnings, 0 section mismatches -------------------------------------------------------------------------------- cu1000-neo_defconfig (mips, gcc-10) — PASS, 0 errors, 0 warnings, 0 section mismatches -------------------------------------------------------------------------------- cu1830-neo_defconfig (mips, gcc-10) — PASS, 0 errors, 0 warnings, 0 section mismatches -------------------------------------------------------------------------------- davinci_all_defconfig (arm, gcc-10) — PASS, 0 errors, 0 warnings, 0 section mismatches -------------------------------------------------------------------------------- db1xxx_defconfig (mips, gcc-10) — PASS, 0 errors, 0 warnings, 0 section mismatches -------------------------------------------------------------------------------- decstation_64_defconfig (mips, gcc-10) — PASS, 0 errors, 1 warning, 0 section mismatches Warnings: kernel/rcu/tasks.h:707:13: warning: ‘show_rcu_tasks_rude_gp_kthread’ defined but not used [-Wunused-function] -------------------------------------------------------------------------------- decstation_defconfig (mips, gcc-10) — PASS, 0 errors, 1 warning, 0 section mismatches Warnings: kernel/rcu/tasks.h:707:13: warning: ‘show_rcu_tasks_rude_gp_kthread’ defined but not used [-Wunused-function] -------------------------------------------------------------------------------- decstation_r4k_defconfig (mips, gcc-10) — PASS, 0 errors, 1 warning, 0 section mismatches Warnings: kernel/rcu/tasks.h:707:13: warning: ‘show_rcu_tasks_rude_gp_kthread’ defined but not used [-Wunused-function] -------------------------------------------------------------------------------- defconfig (riscv, gcc-10) — PASS, 0 errors, 0 warnings, 0 section mismatches -------------------------------------------------------------------------------- defconfig (arm64, gcc-10) — PASS, 0 errors, 0 warnings, 0 section mismatches -------------------------------------------------------------------------------- defconfig+arm64-chromebook (arm64, gcc-10) — PASS, 0 errors, 0 warnings, 0 section mismatches -------------------------------------------------------------------------------- defconfig+arm64-chromebook+kselftest (arm64, gcc-10) — PASS, 0 errors, 0 warnings, 0 section mismatches -------------------------------------------------------------------------------- defconfig+kselftest (arm64, gcc-10) — PASS, 0 errors, 0 warnings, 0 section mismatches -------------------------------------------------------------------------------- dove_defconfig (arm, gcc-10) — PASS, 0 errors, 0 warnings, 0 section mismatches -------------------------------------------------------------------------------- e55_defconfig (mips, gcc-10) — PASS, 0 errors, 0 warnings, 0 section mismatches -------------------------------------------------------------------------------- ebsa110_defconfig (arm, gcc-10) — PASS, 0 errors, 0 warnings, 0 section mismatches -------------------------------------------------------------------------------- efm32_defconfig (arm, gcc-10) — PASS, 0 errors, 0 warnings, 0 section mismatches -------------------------------------------------------------------------------- ep93xx_defconfig (arm, gcc-10) — PASS, 0 errors, 0 warnings, 0 section mismatches Section mismatches: WARNING: modpost: vmlinux.o(.text+0x8054): Section mismatch in reference from the function __arm_ioremap_pfn_caller() to the function .meminit.text:memblock_is_map_memory() -------------------------------------------------------------------------------- eseries_pxa_defconfig (arm, gcc-10) — PASS, 0 errors, 0 warnings, 0 section mismatches -------------------------------------------------------------------------------- exynos_defconfig (arm, gcc-10) — PASS, 0 errors, 0 warnings, 0 section mismatches -------------------------------------------------------------------------------- ezx_defconfig (arm, gcc-10) — PASS, 0 errors, 0 warnings, 0 section mismatches -------------------------------------------------------------------------------- footbridge_defconfig (arm, gcc-10) — PASS, 0 errors, 0 warnings, 0 section mismatches -------------------------------------------------------------------------------- fuloong2e_defconfig (mips, gcc-10) — PASS, 0 errors, 0 warnings, 0 section mismatches -------------------------------------------------------------------------------- gcw0_defconfig (mips, gcc-10) — PASS, 0 errors, 0 warnings, 0 section mismatches -------------------------------------------------------------------------------- gemini_defconfig (arm, gcc-10) — PASS, 0 errors, 0 warnings, 0 section mismatches -------------------------------------------------------------------------------- gpr_defconfig (mips, gcc-10) — PASS, 0 errors, 0 warnings, 0 section mismatches -------------------------------------------------------------------------------- h3600_defconfig (arm, gcc-10) — PASS, 0 errors, 0 warnings, 0 section mismatches Section mismatches: WARNING: modpost: vmlinux.o(.text+0xcb84): Section mismatch in reference from the function __arm_ioremap_pfn_caller() to the function .meminit.text:memblock_is_map_memory() -------------------------------------------------------------------------------- h5000_defconfig (arm, gcc-10) — PASS, 0 errors, 0 warnings, 0 section mismatches -------------------------------------------------------------------------------- hackkit_defconfig (arm, gcc-10) — PASS, 0 errors, 0 warnings, 0 section mismatches Section mismatches: WARNING: modpost: vmlinux.o(.text+0xce9c): Section mismatch in reference from the function __arm_ioremap_pfn_caller() to the function .meminit.text:memblock_is_map_memory() -------------------------------------------------------------------------------- haps_hs_defconfig (arc, gcc-10) — PASS, 0 errors, 0 warnings, 0 section mismatches -------------------------------------------------------------------------------- haps_hs_smp_defconfig (arc, gcc-10) — PASS, 0 errors, 0 warnings, 0 section mismatches -------------------------------------------------------------------------------- hisi_defconfig (arm, gcc-10) — PASS, 0 errors, 0 warnings, 0 section mismatches -------------------------------------------------------------------------------- hsdk_defconfig (arc, gcc-10) — PASS, 0 errors, 0 warnings, 0 section mismatches -------------------------------------------------------------------------------- i386_defconfig (i386, gcc-10) — PASS, 0 errors, 0 warnings, 0 section mismatches -------------------------------------------------------------------------------- imote2_defconfig (arm, gcc-10) — PASS, 0 errors, 0 warnings, 0 section mismatches -------------------------------------------------------------------------------- imx_v4_v5_defconfig (arm, gcc-10) — PASS, 0 errors, 0 warnings, 0 section mismatches -------------------------------------------------------------------------------- imx_v6_v7_defconfig (arm, gcc-10) — PASS, 0 errors, 0 warnings, 0 section mismatches -------------------------------------------------------------------------------- integrator_defconfig (arm, gcc-10) — PASS, 0 errors, 0 warnings, 0 section mismatches -------------------------------------------------------------------------------- iop32x_defconfig (arm, gcc-10) — PASS, 0 errors, 0 warnings, 0 section mismatches -------------------------------------------------------------------------------- ip22_defconfig (mips, gcc-10) — PASS, 0 errors, 0 warnings, 0 section mismatches -------------------------------------------------------------------------------- ip27_defconfig (mips, gcc-10) — FAIL, 0 errors, 0 warnings, 0 section mismatches -------------------------------------------------------------------------------- ip28_defconfig (mips, gcc-10) — FAIL, 0 errors, 0 warnings, 0 section mismatches -------------------------------------------------------------------------------- ip32_defconfig (mips, gcc-10) — PASS, 0 errors, 0 warnings, 0 section mismatches -------------------------------------------------------------------------------- ixp4xx_defconfig (arm, gcc-10) — PASS, 0 errors, 0 warnings, 0 section mismatches -------------------------------------------------------------------------------- jazz_defconfig (mips, gcc-10) — PASS, 0 errors, 0 warnings, 0 section mismatches -------------------------------------------------------------------------------- jmr3927_defconfig (mips, gcc-10) — PASS, 0 errors, 0 warnings, 0 section mismatches -------------------------------------------------------------------------------- jornada720_defconfig (arm, gcc-10) — PASS, 0 errors, 0 warnings, 0 section mismatches Section mismatches: WARNING: modpost: vmlinux.o(.text+0xcaa8): Section mismatch in reference from the function __arm_ioremap_pfn_caller() to the function .meminit.text:memblock_is_map_memory() -------------------------------------------------------------------------------- keystone_defconfig (arm, gcc-10) — PASS, 0 errors, 0 warnings, 0 section mismatches -------------------------------------------------------------------------------- lart_defconfig (arm, gcc-10) — PASS, 0 errors, 0 warnings, 0 section mismatches Section mismatches: WARNING: modpost: vmlinux.o(.text+0xcb74): Section mismatch in reference from the function __arm_ioremap_pfn_caller() to the function .meminit.text:memblock_is_map_memory() -------------------------------------------------------------------------------- lemote2f_defconfig (mips, gcc-10) — PASS, 0 errors, 1 warning, 0 section mismatches Warnings: net/mac80211/mlme.c:4343:1: warning: the frame size of 1040 bytes is larger than 1024 bytes [-Wframe-larger-than=] -------------------------------------------------------------------------------- loongson1b_defconfig (mips, gcc-10) — PASS, 0 errors, 0 warnings, 0 section mismatches -------------------------------------------------------------------------------- loongson1c_defconfig (mips, gcc-10) — PASS, 0 errors, 0 warnings, 0 section mismatches -------------------------------------------------------------------------------- loongson3_defconfig (mips, gcc-10) — PASS, 0 errors, 0 warnings, 0 section mismatches -------------------------------------------------------------------------------- lpc18xx_defconfig (arm, gcc-10) — PASS, 0 errors, 0 warnings, 0 section mismatches -------------------------------------------------------------------------------- lpc32xx_defconfig (arm, gcc-10) — PASS, 0 errors, 0 warnings, 0 section mismatches -------------------------------------------------------------------------------- lpd270_defconfig (arm, gcc-10) — PASS, 0 errors, 0 warnings, 0 section mismatches -------------------------------------------------------------------------------- lubbock_defconfig (arm, gcc-10) — PASS, 0 errors, 0 warnings, 0 section mismatches -------------------------------------------------------------------------------- magician_defconfig (arm, gcc-10) — PASS, 0 errors, 0 warnings, 0 section mismatches -------------------------------------------------------------------------------- mainstone_defconfig (arm, gcc-10) — PASS, 0 errors, 0 warnings, 0 section mismatches -------------------------------------------------------------------------------- malta_defconfig (mips, gcc-10) — PASS, 0 errors, 0 warnings, 0 section mismatches -------------------------------------------------------------------------------- malta_kvm_defconfig (mips, gcc-10) — PASS, 0 errors, 0 warnings, 0 section mismatches -------------------------------------------------------------------------------- malta_kvm_guest_defconfig (mips, gcc-10) — PASS, 0 errors, 0 warnings, 0 section mismatches -------------------------------------------------------------------------------- malta_qemu_32r6_defconfig (mips, gcc-10) — PASS, 0 errors, 0 warnings, 0 section mismatches -------------------------------------------------------------------------------- maltaaprp_defconfig (mips, gcc-10) — PASS, 0 errors, 0 warnings, 0 section mismatches -------------------------------------------------------------------------------- maltasmvp_defconfig (mips, gcc-10) — PASS, 0 errors, 0 warnings, 0 section mismatches -------------------------------------------------------------------------------- maltasmvp_eva_defconfig (mips, gcc-10) — PASS, 0 errors, 0 warnings, 0 section mismatches -------------------------------------------------------------------------------- maltaup_defconfig (mips, gcc-10) — PASS, 0 errors, 0 warnings, 0 section mismatches -------------------------------------------------------------------------------- maltaup_xpa_defconfig (mips, gcc-10) — PASS, 0 errors, 0 warnings, 0 section mismatches -------------------------------------------------------------------------------- milbeaut_m10v_defconfig (arm, gcc-10) — PASS, 0 errors, 0 warnings, 0 section mismatches -------------------------------------------------------------------------------- mini2440_defconfig (arm, gcc-10) — PASS, 0 errors, 0 warnings, 0 section mismatches -------------------------------------------------------------------------------- mmp2_defconfig (arm, gcc-10) — PASS, 0 errors, 0 warnings, 0 section mismatches -------------------------------------------------------------------------------- moxart_defconfig (arm, gcc-10) — PASS, 0 errors, 0 warnings, 0 section mismatches -------------------------------------------------------------------------------- mpc30x_defconfig (mips, gcc-10) — PASS, 0 errors, 0 warnings, 0 section mismatches -------------------------------------------------------------------------------- mps2_defconfig (arm, gcc-10) — PASS, 0 errors, 0 warnings, 0 section mismatches -------------------------------------------------------------------------------- mtx1_defconfig (mips, gcc-10) — PASS, 0 errors, 0 warnings, 0 section mismatches -------------------------------------------------------------------------------- multi_v4t_defconfig (arm, gcc-10) — PASS, 0 errors, 0 warnings, 0 section mismatches -------------------------------------------------------------------------------- multi_v5_defconfig (arm, gcc-10) — PASS, 0 errors, 0 warnings, 0 section mismatches -------------------------------------------------------------------------------- multi_v7_defconfig (arm, gcc-10) — PASS, 0 errors, 0 warnings, 0 section mismatches -------------------------------------------------------------------------------- multi_v7_defconfig+kselftest (arm, gcc-10) — PASS, 0 errors, 0 warnings, 0 section mismatches -------------------------------------------------------------------------------- mvebu_v5_defconfig (arm, gcc-10) — PASS, 0 errors, 0 warnings, 0 section mismatches -------------------------------------------------------------------------------- mvebu_v7_defconfig (arm, gcc-10) — PASS, 0 errors, 0 warnings, 0 section mismatches -------------------------------------------------------------------------------- mxs_defconfig (arm, gcc-10) — PASS, 0 errors, 0 warnings, 0 section mismatches -------------------------------------------------------------------------------- neponset_defconfig (arm, gcc-10) — PASS, 0 errors, 0 warnings, 0 section mismatches Section mismatches: WARNING: modpost: vmlinux.o(.text+0xcda4): Section mismatch in reference from the function __arm_ioremap_pfn_caller() to the function .meminit.text:memblock_is_map_memory() -------------------------------------------------------------------------------- netwinder_defconfig (arm, gcc-10) — PASS, 0 errors, 0 warnings, 0 section mismatches -------------------------------------------------------------------------------- nhk8815_defconfig (arm, gcc-10) — PASS, 0 errors, 0 warnings, 0 section mismatches -------------------------------------------------------------------------------- nlm_xlp_defconfig (mips, gcc-10) — PASS, 0 errors, 0 warnings, 0 section mismatches -------------------------------------------------------------------------------- nlm_xlr_defconfig (mips, gcc-10) — PASS, 0 errors, 0 warnings, 0 section mismatches -------------------------------------------------------------------------------- nommu_k210_defconfig (riscv, gcc-10) — PASS, 0 errors, 0 warnings, 0 section mismatches -------------------------------------------------------------------------------- nsimosci_hs_defconfig (arc, gcc-10) — PASS, 0 errors, 0 warnings, 0 section mismatches -------------------------------------------------------------------------------- nsimosci_hs_smp_defconfig (arc, gcc-10) — PASS, 0 errors, 0 warnings, 0 section mismatches -------------------------------------------------------------------------------- omap1_defconfig (arm, gcc-10) — PASS, 0 errors, 0 warnings, 0 section mismatches -------------------------------------------------------------------------------- omap2plus_defconfig (arm, gcc-10) — PASS, 0 errors, 0 warnings, 0 section mismatches -------------------------------------------------------------------------------- omega2p_defconfig (mips, gcc-10) — PASS, 0 errors, 0 warnings, 0 section mismatches -------------------------------------------------------------------------------- orion5x_defconfig (arm, gcc-10) — PASS, 0 errors, 0 warnings, 0 section mismatches -------------------------------------------------------------------------------- oxnas_v6_defconfig (arm, gcc-10) — PASS, 0 errors, 0 warnings, 0 section mismatches -------------------------------------------------------------------------------- palmz72_defconfig (arm, gcc-10) — PASS, 0 errors, 0 warnings, 0 section mismatches -------------------------------------------------------------------------------- pcm027_defconfig (arm, gcc-10) — PASS, 0 errors, 0 warnings, 0 section mismatches -------------------------------------------------------------------------------- pic32mzda_defconfig (mips, gcc-10) — PASS, 0 errors, 0 warnings, 0 section mismatches -------------------------------------------------------------------------------- pistachio_defconfig (mips, gcc-10) — PASS, 0 errors, 0 warnings, 0 section mismatches -------------------------------------------------------------------------------- pleb_defconfig (arm, gcc-10) — PASS, 0 errors, 0 warnings, 0 section mismatches Section mismatches: WARNING: modpost: vmlinux.o(.text+0xc8ec): Section mismatch in reference from the function __arm_ioremap_pfn_caller() to the function .meminit.text:memblock_is_map_memory() -------------------------------------------------------------------------------- prima2_defconfig (arm, gcc-10) — PASS, 0 errors, 0 warnings, 0 section mismatches -------------------------------------------------------------------------------- pxa168_defconfig (arm, gcc-10) — PASS, 0 errors, 0 warnings, 0 section mismatches -------------------------------------------------------------------------------- pxa255-idp_defconfig (arm, gcc-10) — PASS, 0 errors, 0 warnings, 0 section mismatches -------------------------------------------------------------------------------- pxa3xx_defconfig (arm, gcc-10) — PASS, 0 errors, 0 warnings, 0 section mismatches -------------------------------------------------------------------------------- pxa910_defconfig (arm, gcc-10) — PASS, 0 errors, 0 warnings, 0 section mismatches -------------------------------------------------------------------------------- pxa_defconfig (arm, gcc-10) — PASS, 0 errors, 0 warnings, 0 section mismatches -------------------------------------------------------------------------------- qcom_defconfig (arm, gcc-10) — PASS, 0 errors, 0 warnings, 0 section mismatches -------------------------------------------------------------------------------- qi_lb60_defconfig (mips, gcc-10) — PASS, 0 errors, 0 warnings, 0 section mismatches -------------------------------------------------------------------------------- rb532_defconfig (mips, gcc-10) — PASS, 0 errors, 0 warnings, 0 section mismatches -------------------------------------------------------------------------------- rbtx49xx_defconfig (mips, gcc-10) — PASS, 0 errors, 0 warnings, 0 section mismatches -------------------------------------------------------------------------------- realview_defconfig (arm, gcc-10) — PASS, 0 errors, 0 warnings, 0 section mismatches -------------------------------------------------------------------------------- rm200_defconfig (mips, gcc-10) — PASS, 0 errors, 1 warning, 0 section mismatches Warnings: drivers/block/paride/bpck.c:32: warning: "PC" redefined -------------------------------------------------------------------------------- rpc_defconfig (arm, gcc-10) — FAIL, 4 errors, 0 warnings, 0 section mismatches Errors: arm-linux-gnueabihf-gcc: error: unrecognized -march target: armv3m arm-linux-gnueabihf-gcc: error: missing argument to ‘-march=’ arm-linux-gnueabihf-gcc: error: unrecognized -march target: armv3m arm-linux-gnueabihf-gcc: error: missing argument to ‘-march=’ -------------------------------------------------------------------------------- rs90_defconfig (mips, gcc-10) — PASS, 0 errors, 0 warnings, 0 section mismatches -------------------------------------------------------------------------------- rt305x_defconfig (mips, gcc-10) — PASS, 0 errors, 0 warnings, 0 section mismatches -------------------------------------------------------------------------------- rv32_defconfig (riscv, gcc-10) — PASS, 0 errors, 4 warnings, 0 section mismatches Warnings: <stdin>:830:2: warning: #warning syscall fstat64 not implemented [-Wcpp] <stdin>:1127:2: warning: #warning syscall fstatat64 not implemented [-Wcpp] <stdin>:830:2: warning: #warning syscall fstat64 not implemented [-Wcpp] <stdin>:1127:2: warning: #warning syscall fstatat64 not implemented [-Wcpp] -------------------------------------------------------------------------------- s3c2410_defconfig (arm, gcc-10) — PASS, 0 errors, 0 warnings, 0 section mismatches -------------------------------------------------------------------------------- s3c6400_defconfig (arm, gcc-10) — PASS, 0 errors, 0 warnings, 0 section mismatches -------------------------------------------------------------------------------- s5pv210_defconfig (arm, gcc-10) — PASS, 0 errors, 0 warnings, 0 section mismatches -------------------------------------------------------------------------------- sama5_defconfig (arm, gcc-10) — PASS, 0 errors, 0 warnings, 0 section mismatches -------------------------------------------------------------------------------- sb1250_swarm_defconfig (mips, gcc-10) — PASS, 0 errors, 0 warnings, 0 section mismatches -------------------------------------------------------------------------------- shannon_defconfig (arm, gcc-10) — PASS, 0 errors, 0 warnings, 0 section mismatches Section mismatches: WARNING: modpost: vmlinux.o(.text+0xcb4c): Section mismatch in reference from the function __arm_ioremap_pfn_caller() to the function .meminit.text:memblock_is_map_memory() -------------------------------------------------------------------------------- shmobile_defconfig (arm, gcc-10) — PASS, 0 errors, 0 warnings, 0 section mismatches -------------------------------------------------------------------------------- simpad_defconfig (arm, gcc-10) — PASS, 0 errors, 0 warnings, 0 section mismatches Section mismatches: WARNING: modpost: vmlinux.o(.text+0xd040): Section mismatch in reference from the function __arm_ioremap_pfn_caller() to the function .meminit.text:memblock_is_map_memory() -------------------------------------------------------------------------------- socfpga_defconfig (arm, gcc-10) — PASS, 0 errors, 0 warnings, 0 section mismatches -------------------------------------------------------------------------------- spear13xx_defconfig (arm, gcc-10) — PASS, 0 errors, 0 warnings, 0 section mismatches -------------------------------------------------------------------------------- spear3xx_defconfig (arm, gcc-10) — PASS, 0 errors, 0 warnings, 0 section mismatches -------------------------------------------------------------------------------- spear6xx_defconfig (arm, gcc-10) — PASS, 0 errors, 0 warnings, 0 section mismatches -------------------------------------------------------------------------------- spitz_defconfig (arm, gcc-10) — PASS, 0 errors, 0 warnings, 0 section mismatches -------------------------------------------------------------------------------- stm32_defconfig (arm, gcc-10) — PASS, 0 errors, 0 warnings, 0 section mismatches -------------------------------------------------------------------------------- sunxi_defconfig (arm, gcc-10) — PASS, 0 errors, 0 warnings, 0 section mismatches -------------------------------------------------------------------------------- tango4_defconfig (arm, gcc-10) — PASS, 0 errors, 0 warnings, 0 section mismatches -------------------------------------------------------------------------------- tb0219_defconfig (mips, gcc-10) — PASS, 0 errors, 0 warnings, 0 section mismatches -------------------------------------------------------------------------------- tb0226_defconfig (mips, gcc-10) — PASS, 0 errors, 0 warnings, 0 section mismatches -------------------------------------------------------------------------------- tb0287_defconfig (mips, gcc-10) — PASS, 0 errors, 0 warnings, 0 section mismatches -------------------------------------------------------------------------------- tct_hammer_defconfig (arm, gcc-10) — PASS, 0 errors, 0 warnings, 0 section mismatches -------------------------------------------------------------------------------- tegra_defconfig (arm, gcc-10) — PASS, 0 errors, 0 warnings, 0 section mismatches -------------------------------------------------------------------------------- tinyconfig (x86_64, gcc-10) — PASS, 0 errors, 0 warnings, 0 section mismatches -------------------------------------------------------------------------------- tinyconfig (i386, gcc-10) — PASS, 0 errors, 0 warnings, 0 section mismatches -------------------------------------------------------------------------------- tinyconfig (arc, gcc-10) — PASS, 0 errors, 0 warnings, 0 section mismatches -------------------------------------------------------------------------------- trizeps4_defconfig (arm, gcc-10) — PASS, 0 errors, 0 warnings, 0 section mismatches -------------------------------------------------------------------------------- u300_defconfig (arm, gcc-10) — PASS, 0 errors, 0 warnings, 0 section mismatches -------------------------------------------------------------------------------- u8500_defconfig (arm, gcc-10) — PASS, 0 errors, 0 warnings, 0 section mismatches -------------------------------------------------------------------------------- vdk_hs38_defconfig (arc, gcc-10) — PASS, 0 errors, 0 warnings, 0 section mismatches -------------------------------------------------------------------------------- vdk_hs38_smp_defconfig (arc, gcc-10) — PASS, 0 errors, 0 warnings, 0 section mismatches -------------------------------------------------------------------------------- versatile_defconfig (arm, gcc-10) — PASS, 0 errors, 0 warnings, 0 section mismatches -------------------------------------------------------------------------------- vexpress_defconfig (arm, gcc-10) — PASS, 0 errors, 0 warnings, 0 section mismatches -------------------------------------------------------------------------------- vf610m4_defconfig (arm, gcc-10) — PASS, 0 errors, 0 warnings, 0 section mismatches -------------------------------------------------------------------------------- viper_defconfig (arm, gcc-10) — PASS, 0 errors, 0 warnings, 0 section mismatches -------------------------------------------------------------------------------- vocore2_defconfig (mips, gcc-10) — PASS, 0 errors, 0 warnings, 0 section mismatches -------------------------------------------------------------------------------- vt8500_v6_v7_defconfig (arm, gcc-10) — PASS, 0 errors, 0 warnings, 0 section mismatches -------------------------------------------------------------------------------- workpad_defconfig (mips, gcc-10) — PASS, 0 errors, 0 warnings, 0 section mismatches -------------------------------------------------------------------------------- x86_64_defconfig (x86_64, gcc-10) — PASS, 0 errors, 0 warnings, 0 section mismatches -------------------------------------------------------------------------------- x86_64_defconfig+kselftest (x86_64, gcc-10) — PASS, 0 errors, 0 warnings, 0 section mismatches -------------------------------------------------------------------------------- x86_64_defconfig+x86-chromebook (x86_64, gcc-10) — PASS, 0 errors, 0 warnings, 0 section mismatches -------------------------------------------------------------------------------- x86_64_defconfig+x86-chromebook+kselftest (x86_64, gcc-10) — PASS, 0 errors, 0 warnings, 0 section mismatches -------------------------------------------------------------------------------- xcep_defconfig (arm, gcc-10) — PASS, 0 errors, 0 warnings, 0 section mismatches -------------------------------------------------------------------------------- zeus_defconfig (arm, gcc-10) — PASS, 0 errors, 0 warnings, 0 section mismatches -------------------------------------------------------------------------------- zx_defconfig (arm, gcc-10) — PASS, 0 errors, 0 warnings, 0 section mismatches --- For more info write to <info(a)kernelci.org>
3 years
1
0
0
0
cip/linux-4.19.y-cip baseline-nfs: 8 runs, 1 regressions (v4.19.235-cip70)
by kernelci.org bot
cip/linux-4.19.y-cip baseline-nfs: 8 runs, 1 regressions (v4.19.235-cip70) Regressions Summary ------------------- platform | arch | lab | compiler | defconfig | regressions -----------------+-------+---------------+----------+----------------------------+------------ rk3399-gru-kevin | arm64 | lab-collabora | gcc-10 | defconfig+arm64-chromebook | 1 Details:
https://kernelci.org/test/job/cip/branch/linux-4.19.y-cip/kernel/v4.19.235-…
Test: baseline-nfs Tree: cip Branch: linux-4.19.y-cip Describe: v4.19.235-cip70 URL:
https://git.kernel.org/pub/scm/linux/kernel/git/cip/linux-cip.git
SHA: 91567a6adc2cb5217b6d7aabf7da3ac9ae6f1a79 Test Regressions ---------------- platform | arch | lab | compiler | defconfig | regressions -----------------+-------+---------------+----------+----------------------------+------------ rk3399-gru-kevin | arm64 | lab-collabora | gcc-10 | defconfig+arm64-chromebook | 1 Details:
https://kernelci.org/test/plan/id/6242d81a06bdf7f640ae0694
Results: 82 PASS, 6 FAIL, 0 SKIP Full config: defconfig+arm64-chromebook Compiler: gcc-10 (aarch64-linux-gnu-gcc (Debian 10.2.1-6) 10.2.1 20210110) Plain log:
https://storage.kernelci.org//cip/linux-4.19.y-cip/v4.19.235-cip70/arm64/de…
HTML log:
https://storage.kernelci.org//cip/linux-4.19.y-cip/v4.19.235-cip70/arm64/de…
Rootfs:
http://storage.kernelci.org/images/rootfs/debian/bullseye/20220311.1/arm64/…
* baseline-nfs.bootrr.rockchip-i2s1-probed:
https://kernelci.org/test/case/id/6242d81b06bdf7f640ae06b5
new failure (last pass: v4.19.229-cip67) 2022-03-29T09:57:22.749317 <8>[ 37.456083] <LAVA_SIGNAL_TESTCASE TEST_CASE_ID=rockchip-i2s0-probed RESULT=pass> 2022-03-29T09:57:23.773892 /lava-5968685/1/../bin/lava-test-case 2022-03-29T09:57:23.800683 <8>[ 38.507222] <LAVA_SIGNAL_TESTCASE TEST_CASE_ID=rockchip-i2s1-probed RESULT=fail>
3 years
1
0
0
0
cip/linux-4.19.y-cip baseline: 86 runs, 1 regressions (v4.19.235-cip70)
by kernelci.org bot
cip/linux-4.19.y-cip baseline: 86 runs, 1 regressions (v4.19.235-cip70) Regressions Summary ------------------- platform | arch | lab | compiler | defconfig | regressions -----------------+-------+---------------+----------+----------------------------+------------ rk3399-gru-kevin | arm64 | lab-collabora | gcc-10 | defconfig+arm64-chromebook | 1 Details:
https://kernelci.org/test/job/cip/branch/linux-4.19.y-cip/kernel/v4.19.235-…
Test: baseline Tree: cip Branch: linux-4.19.y-cip Describe: v4.19.235-cip70 URL:
https://git.kernel.org/pub/scm/linux/kernel/git/cip/linux-cip.git
SHA: 91567a6adc2cb5217b6d7aabf7da3ac9ae6f1a79 Test Regressions ---------------- platform | arch | lab | compiler | defconfig | regressions -----------------+-------+---------------+----------+----------------------------+------------ rk3399-gru-kevin | arm64 | lab-collabora | gcc-10 | defconfig+arm64-chromebook | 1 Details:
https://kernelci.org/test/plan/id/6242d681606a2910b1ae067c
Results: 83 PASS, 7 FAIL, 0 SKIP Full config: defconfig+arm64-chromebook Compiler: gcc-10 (aarch64-linux-gnu-gcc (Debian 10.2.1-6) 10.2.1 20210110) Plain log:
https://storage.kernelci.org//cip/linux-4.19.y-cip/v4.19.235-cip70/arm64/de…
HTML log:
https://storage.kernelci.org//cip/linux-4.19.y-cip/v4.19.235-cip70/arm64/de…
Rootfs:
http://storage.kernelci.org/images/rootfs/buildroot/buildroot-baseline/2022…
* baseline.bootrr.rockchip-i2s1-probed:
https://kernelci.org/test/case/id/6242d681606a2910b1ae069e
new failure (last pass: v4.19.229-cip67) 2022-03-29T09:50:50.951167 /lava-5968679/1/../bin/lava-test-case 2022-03-29T09:50:50.959880 <8>[ 36.756488] <LAVA_SIGNAL_TESTCASE TEST_CASE_ID=rockchip-i2s1-probed RESULT=fail>
3 years
1
0
0
0
cip/linux-4.19.y-cip build: 120 builds: 1 failed, 119 passed, 2 errors, 22 warnings (v4.19.235-cip70)
by kernelci.org bot
cip/linux-4.19.y-cip build: 120 builds: 1 failed, 119 passed, 2 errors, 22 warnings (v4.19.235-cip70) Full Build Summary:
https://kernelci.org/build/cip/branch/linux-4.19.y-cip/kernel/v4.19.235-cip…
Tree: cip Branch: linux-4.19.y-cip Git Describe: v4.19.235-cip70 Git Commit: 91567a6adc2cb5217b6d7aabf7da3ac9ae6f1a79 Git URL:
https://git.kernel.org/pub/scm/linux/kernel/git/cip/linux-cip.git
Built: 3 unique architectures Build Failure Detected: arm: rpc_defconfig: (gcc-10) FAIL Errors and Warnings Detected: arm64: cip://4.19.y-cip/arm64/qemu_arm64_defconfig (gcc-10): 3 warnings defconfig (gcc-10): 3 warnings defconfig+arm64-chromebook (gcc-10): 3 warnings arm: omap1_defconfig (gcc-10): 1 warning rpc_defconfig (gcc-10): 2 errors x86_64: allnoconfig (gcc-10): 3 warnings cip://4.19.y-cip/x86/cip_qemu_defconfig (gcc-10): 3 warnings x86_64_defconfig (gcc-10): 3 warnings x86_64_defconfig+x86-chromebook (gcc-10): 3 warnings Errors summary: 1 arm-linux-gnueabihf-gcc: error: unrecognized -march target: armv3 1 arm-linux-gnueabihf-gcc: error: missing argument to ‘-march=’ Warnings summary: 9 aarch64-linux-gnu-ld: warning: -z norelro ignored 4 ld: warning: creating DT_TEXTREL in a PIE 4 ld: arch/x86/boot/compressed/head_64.o: warning: relocation in read-only section `.head.text' 4 arch/x86/entry/entry_64.S:1738: Warning: no instruction mnemonic suffix given and no register operands; using default for `sysret' 1 drivers/gpio/gpio-omap.c:1233:34: warning: array ‘omap_gpio_match’ assumed to have one element ================================================================================ Detailed per-defconfig build reports: -------------------------------------------------------------------------------- acs5k_defconfig (arm, gcc-10) — PASS, 0 errors, 0 warnings, 0 section mismatches -------------------------------------------------------------------------------- acs5k_tiny_defconfig (arm, gcc-10) — PASS, 0 errors, 0 warnings, 0 section mismatches -------------------------------------------------------------------------------- allnoconfig (x86_64, gcc-10) — PASS, 0 errors, 3 warnings, 0 section mismatches Warnings: arch/x86/entry/entry_64.S:1738: Warning: no instruction mnemonic suffix given and no register operands; using default for `sysret' ld: arch/x86/boot/compressed/head_64.o: warning: relocation in read-only section `.head.text' ld: warning: creating DT_TEXTREL in a PIE -------------------------------------------------------------------------------- am200epdkit_defconfig (arm, gcc-10) — PASS, 0 errors, 0 warnings, 0 section mismatches -------------------------------------------------------------------------------- aspeed_g4_defconfig (arm, gcc-10) — PASS, 0 errors, 0 warnings, 0 section mismatches -------------------------------------------------------------------------------- aspeed_g5_defconfig (arm, gcc-10) — PASS, 0 errors, 0 warnings, 0 section mismatches -------------------------------------------------------------------------------- assabet_defconfig (arm, gcc-10) — PASS, 0 errors, 0 warnings, 0 section mismatches -------------------------------------------------------------------------------- at91_dt_defconfig (arm, gcc-10) — PASS, 0 errors, 0 warnings, 0 section mismatches -------------------------------------------------------------------------------- axm55xx_defconfig (arm, gcc-10) — PASS, 0 errors, 0 warnings, 0 section mismatches -------------------------------------------------------------------------------- badge4_defconfig (arm, gcc-10) — PASS, 0 errors, 0 warnings, 0 section mismatches -------------------------------------------------------------------------------- bcm2835_defconfig (arm, gcc-10) — PASS, 0 errors, 0 warnings, 0 section mismatches -------------------------------------------------------------------------------- cerfcube_defconfig (arm, gcc-10) — PASS, 0 errors, 0 warnings, 0 section mismatches -------------------------------------------------------------------------------- cip://4.19.y-cip/arm/qemu_arm_defconfig (arm, gcc-10) — PASS, 0 errors, 0 warnings, 0 section mismatches -------------------------------------------------------------------------------- cip://4.19.y-cip/arm64/qemu_arm64_defconfig (arm64, gcc-10) — PASS, 0 errors, 3 warnings, 0 section mismatches Warnings: aarch64-linux-gnu-ld: warning: -z norelro ignored aarch64-linux-gnu-ld: warning: -z norelro ignored aarch64-linux-gnu-ld: warning: -z norelro ignored -------------------------------------------------------------------------------- cip://4.19.y-cip/x86/cip_qemu_defconfig (x86_64, gcc-10) — PASS, 0 errors, 3 warnings, 0 section mismatches Warnings: arch/x86/entry/entry_64.S:1738: Warning: no instruction mnemonic suffix given and no register operands; using default for `sysret' ld: arch/x86/boot/compressed/head_64.o: warning: relocation in read-only section `.head.text' ld: warning: creating DT_TEXTREL in a PIE -------------------------------------------------------------------------------- cm_x2xx_defconfig (arm, gcc-10) — PASS, 0 errors, 0 warnings, 0 section mismatches -------------------------------------------------------------------------------- cm_x300_defconfig (arm, gcc-10) — PASS, 0 errors, 0 warnings, 0 section mismatches -------------------------------------------------------------------------------- colibri_pxa270_defconfig (arm, gcc-10) — PASS, 0 errors, 0 warnings, 0 section mismatches -------------------------------------------------------------------------------- colibri_pxa300_defconfig (arm, gcc-10) — PASS, 0 errors, 0 warnings, 0 section mismatches -------------------------------------------------------------------------------- collie_defconfig (arm, gcc-10) — PASS, 0 errors, 0 warnings, 0 section mismatches -------------------------------------------------------------------------------- corgi_defconfig (arm, gcc-10) — PASS, 0 errors, 0 warnings, 0 section mismatches -------------------------------------------------------------------------------- davinci_all_defconfig (arm, gcc-10) — PASS, 0 errors, 0 warnings, 0 section mismatches -------------------------------------------------------------------------------- defconfig (arm64, gcc-10) — PASS, 0 errors, 3 warnings, 0 section mismatches Warnings: aarch64-linux-gnu-ld: warning: -z norelro ignored aarch64-linux-gnu-ld: warning: -z norelro ignored aarch64-linux-gnu-ld: warning: -z norelro ignored -------------------------------------------------------------------------------- defconfig+arm64-chromebook (arm64, gcc-10) — PASS, 0 errors, 3 warnings, 0 section mismatches Warnings: aarch64-linux-gnu-ld: warning: -z norelro ignored aarch64-linux-gnu-ld: warning: -z norelro ignored aarch64-linux-gnu-ld: warning: -z norelro ignored -------------------------------------------------------------------------------- dove_defconfig (arm, gcc-10) — PASS, 0 errors, 0 warnings, 0 section mismatches -------------------------------------------------------------------------------- ebsa110_defconfig (arm, gcc-10) — PASS, 0 errors, 0 warnings, 0 section mismatches -------------------------------------------------------------------------------- efm32_defconfig (arm, gcc-10) — PASS, 0 errors, 0 warnings, 0 section mismatches -------------------------------------------------------------------------------- em_x270_defconfig (arm, gcc-10) — PASS, 0 errors, 0 warnings, 0 section mismatches -------------------------------------------------------------------------------- ep93xx_defconfig (arm, gcc-10) — PASS, 0 errors, 0 warnings, 0 section mismatches -------------------------------------------------------------------------------- eseries_pxa_defconfig (arm, gcc-10) — PASS, 0 errors, 0 warnings, 0 section mismatches -------------------------------------------------------------------------------- exynos_defconfig (arm, gcc-10) — PASS, 0 errors, 0 warnings, 0 section mismatches -------------------------------------------------------------------------------- ezx_defconfig (arm, gcc-10) — PASS, 0 errors, 0 warnings, 0 section mismatches -------------------------------------------------------------------------------- footbridge_defconfig (arm, gcc-10) — PASS, 0 errors, 0 warnings, 0 section mismatches -------------------------------------------------------------------------------- gemini_defconfig (arm, gcc-10) — PASS, 0 errors, 0 warnings, 0 section mismatches -------------------------------------------------------------------------------- h3600_defconfig (arm, gcc-10) — PASS, 0 errors, 0 warnings, 0 section mismatches -------------------------------------------------------------------------------- h5000_defconfig (arm, gcc-10) — PASS, 0 errors, 0 warnings, 0 section mismatches -------------------------------------------------------------------------------- hackkit_defconfig (arm, gcc-10) — PASS, 0 errors, 0 warnings, 0 section mismatches -------------------------------------------------------------------------------- hisi_defconfig (arm, gcc-10) — PASS, 0 errors, 0 warnings, 0 section mismatches -------------------------------------------------------------------------------- imote2_defconfig (arm, gcc-10) — PASS, 0 errors, 0 warnings, 0 section mismatches -------------------------------------------------------------------------------- imx_v4_v5_defconfig (arm, gcc-10) — PASS, 0 errors, 0 warnings, 0 section mismatches -------------------------------------------------------------------------------- imx_v6_v7_defconfig (arm, gcc-10) — PASS, 0 errors, 0 warnings, 0 section mismatches -------------------------------------------------------------------------------- integrator_defconfig (arm, gcc-10) — PASS, 0 errors, 0 warnings, 0 section mismatches -------------------------------------------------------------------------------- iop13xx_defconfig (arm, gcc-10) — PASS, 0 errors, 0 warnings, 0 section mismatches -------------------------------------------------------------------------------- iop32x_defconfig (arm, gcc-10) — PASS, 0 errors, 0 warnings, 0 section mismatches -------------------------------------------------------------------------------- iop33x_defconfig (arm, gcc-10) — PASS, 0 errors, 0 warnings, 0 section mismatches -------------------------------------------------------------------------------- ixp4xx_defconfig (arm, gcc-10) — PASS, 0 errors, 0 warnings, 0 section mismatches -------------------------------------------------------------------------------- jornada720_defconfig (arm, gcc-10) — PASS, 0 errors, 0 warnings, 0 section mismatches -------------------------------------------------------------------------------- keystone_defconfig (arm, gcc-10) — PASS, 0 errors, 0 warnings, 0 section mismatches -------------------------------------------------------------------------------- ks8695_defconfig (arm, gcc-10) — PASS, 0 errors, 0 warnings, 0 section mismatches -------------------------------------------------------------------------------- lart_defconfig (arm, gcc-10) — PASS, 0 errors, 0 warnings, 0 section mismatches -------------------------------------------------------------------------------- lpc18xx_defconfig (arm, gcc-10) — PASS, 0 errors, 0 warnings, 0 section mismatches -------------------------------------------------------------------------------- lpc32xx_defconfig (arm, gcc-10) — PASS, 0 errors, 0 warnings, 0 section mismatches -------------------------------------------------------------------------------- lpd270_defconfig (arm, gcc-10) — PASS, 0 errors, 0 warnings, 0 section mismatches -------------------------------------------------------------------------------- lubbock_defconfig (arm, gcc-10) — PASS, 0 errors, 0 warnings, 0 section mismatches -------------------------------------------------------------------------------- magician_defconfig (arm, gcc-10) — PASS, 0 errors, 0 warnings, 0 section mismatches -------------------------------------------------------------------------------- mainstone_defconfig (arm, gcc-10) — PASS, 0 errors, 0 warnings, 0 section mismatches -------------------------------------------------------------------------------- mini2440_defconfig (arm, gcc-10) — PASS, 0 errors, 0 warnings, 0 section mismatches -------------------------------------------------------------------------------- mmp2_defconfig (arm, gcc-10) — PASS, 0 errors, 0 warnings, 0 section mismatches -------------------------------------------------------------------------------- moxart_defconfig (arm, gcc-10) — PASS, 0 errors, 0 warnings, 0 section mismatches -------------------------------------------------------------------------------- mps2_defconfig (arm, gcc-10) — PASS, 0 errors, 0 warnings, 0 section mismatches -------------------------------------------------------------------------------- multi_v4t_defconfig (arm, gcc-10) — PASS, 0 errors, 0 warnings, 0 section mismatches -------------------------------------------------------------------------------- multi_v5_defconfig (arm, gcc-10) — PASS, 0 errors, 0 warnings, 0 section mismatches -------------------------------------------------------------------------------- multi_v7_defconfig (arm, gcc-10) — PASS, 0 errors, 0 warnings, 0 section mismatches -------------------------------------------------------------------------------- mvebu_v5_defconfig (arm, gcc-10) — PASS, 0 errors, 0 warnings, 0 section mismatches -------------------------------------------------------------------------------- mvebu_v7_defconfig (arm, gcc-10) — PASS, 0 errors, 0 warnings, 0 section mismatches -------------------------------------------------------------------------------- mxs_defconfig (arm, gcc-10) — PASS, 0 errors, 0 warnings, 0 section mismatches -------------------------------------------------------------------------------- neponset_defconfig (arm, gcc-10) — PASS, 0 errors, 0 warnings, 0 section mismatches -------------------------------------------------------------------------------- netwinder_defconfig (arm, gcc-10) — PASS, 0 errors, 0 warnings, 0 section mismatches -------------------------------------------------------------------------------- netx_defconfig (arm, gcc-10) — PASS, 0 errors, 0 warnings, 0 section mismatches -------------------------------------------------------------------------------- nhk8815_defconfig (arm, gcc-10) — PASS, 0 errors, 0 warnings, 0 section mismatches -------------------------------------------------------------------------------- nuc910_defconfig (arm, gcc-10) — PASS, 0 errors, 0 warnings, 0 section mismatches -------------------------------------------------------------------------------- nuc950_defconfig (arm, gcc-10) — PASS, 0 errors, 0 warnings, 0 section mismatches -------------------------------------------------------------------------------- nuc960_defconfig (arm, gcc-10) — PASS, 0 errors, 0 warnings, 0 section mismatches -------------------------------------------------------------------------------- omap1_defconfig (arm, gcc-10) — PASS, 0 errors, 1 warning, 0 section mismatches Warnings: drivers/gpio/gpio-omap.c:1233:34: warning: array ‘omap_gpio_match’ assumed to have one element -------------------------------------------------------------------------------- omap2plus_defconfig (arm, gcc-10) — PASS, 0 errors, 0 warnings, 0 section mismatches -------------------------------------------------------------------------------- orion5x_defconfig (arm, gcc-10) — PASS, 0 errors, 0 warnings, 0 section mismatches -------------------------------------------------------------------------------- oxnas_v6_defconfig (arm, gcc-10) — PASS, 0 errors, 0 warnings, 0 section mismatches -------------------------------------------------------------------------------- palmz72_defconfig (arm, gcc-10) — PASS, 0 errors, 0 warnings, 0 section mismatches -------------------------------------------------------------------------------- pcm027_defconfig (arm, gcc-10) — PASS, 0 errors, 0 warnings, 0 section mismatches -------------------------------------------------------------------------------- pleb_defconfig (arm, gcc-10) — PASS, 0 errors, 0 warnings, 0 section mismatches -------------------------------------------------------------------------------- prima2_defconfig (arm, gcc-10) — PASS, 0 errors, 0 warnings, 0 section mismatches -------------------------------------------------------------------------------- pxa168_defconfig (arm, gcc-10) — PASS, 0 errors, 0 warnings, 0 section mismatches -------------------------------------------------------------------------------- pxa255-idp_defconfig (arm, gcc-10) — PASS, 0 errors, 0 warnings, 0 section mismatches -------------------------------------------------------------------------------- pxa3xx_defconfig (arm, gcc-10) — PASS, 0 errors, 0 warnings, 0 section mismatches -------------------------------------------------------------------------------- pxa910_defconfig (arm, gcc-10) — PASS, 0 errors, 0 warnings, 0 section mismatches -------------------------------------------------------------------------------- pxa_defconfig (arm, gcc-10) — PASS, 0 errors, 0 warnings, 0 section mismatches -------------------------------------------------------------------------------- qcom_defconfig (arm, gcc-10) — PASS, 0 errors, 0 warnings, 0 section mismatches -------------------------------------------------------------------------------- raumfeld_defconfig (arm, gcc-10) — PASS, 0 errors, 0 warnings, 0 section mismatches -------------------------------------------------------------------------------- realview_defconfig (arm, gcc-10) — PASS, 0 errors, 0 warnings, 0 section mismatches -------------------------------------------------------------------------------- rpc_defconfig (arm, gcc-10) — FAIL, 2 errors, 0 warnings, 0 section mismatches Errors: arm-linux-gnueabihf-gcc: error: unrecognized -march target: armv3 arm-linux-gnueabihf-gcc: error: missing argument to ‘-march=’ -------------------------------------------------------------------------------- s3c2410_defconfig (arm, gcc-10) — PASS, 0 errors, 0 warnings, 0 section mismatches -------------------------------------------------------------------------------- s3c6400_defconfig (arm, gcc-10) — PASS, 0 errors, 0 warnings, 0 section mismatches -------------------------------------------------------------------------------- s5pv210_defconfig (arm, gcc-10) — PASS, 0 errors, 0 warnings, 0 section mismatches -------------------------------------------------------------------------------- sama5_defconfig (arm, gcc-10) — PASS, 0 errors, 0 warnings, 0 section mismatches -------------------------------------------------------------------------------- shannon_defconfig (arm, gcc-10) — PASS, 0 errors, 0 warnings, 0 section mismatches -------------------------------------------------------------------------------- shmobile_defconfig (arm, gcc-10) — PASS, 0 errors, 0 warnings, 0 section mismatches -------------------------------------------------------------------------------- simpad_defconfig (arm, gcc-10) — PASS, 0 errors, 0 warnings, 0 section mismatches -------------------------------------------------------------------------------- socfpga_defconfig (arm, gcc-10) — PASS, 0 errors, 0 warnings, 0 section mismatches -------------------------------------------------------------------------------- spear13xx_defconfig (arm, gcc-10) — PASS, 0 errors, 0 warnings, 0 section mismatches -------------------------------------------------------------------------------- spear3xx_defconfig (arm, gcc-10) — PASS, 0 errors, 0 warnings, 0 section mismatches -------------------------------------------------------------------------------- spear6xx_defconfig (arm, gcc-10) — PASS, 0 errors, 0 warnings, 0 section mismatches -------------------------------------------------------------------------------- spitz_defconfig (arm, gcc-10) — PASS, 0 errors, 0 warnings, 0 section mismatches -------------------------------------------------------------------------------- stm32_defconfig (arm, gcc-10) — PASS, 0 errors, 0 warnings, 0 section mismatches -------------------------------------------------------------------------------- sunxi_defconfig (arm, gcc-10) — PASS, 0 errors, 0 warnings, 0 section mismatches -------------------------------------------------------------------------------- tango4_defconfig (arm, gcc-10) — PASS, 0 errors, 0 warnings, 0 section mismatches -------------------------------------------------------------------------------- tct_hammer_defconfig (arm, gcc-10) — PASS, 0 errors, 0 warnings, 0 section mismatches -------------------------------------------------------------------------------- tegra_defconfig (arm, gcc-10) — PASS, 0 errors, 0 warnings, 0 section mismatches -------------------------------------------------------------------------------- trizeps4_defconfig (arm, gcc-10) — PASS, 0 errors, 0 warnings, 0 section mismatches -------------------------------------------------------------------------------- u300_defconfig (arm, gcc-10) — PASS, 0 errors, 0 warnings, 0 section mismatches -------------------------------------------------------------------------------- u8500_defconfig (arm, gcc-10) — PASS, 0 errors, 0 warnings, 0 section mismatches -------------------------------------------------------------------------------- versatile_defconfig (arm, gcc-10) — PASS, 0 errors, 0 warnings, 0 section mismatches -------------------------------------------------------------------------------- vexpress_defconfig (arm, gcc-10) — PASS, 0 errors, 0 warnings, 0 section mismatches -------------------------------------------------------------------------------- vf610m4_defconfig (arm, gcc-10) — PASS, 0 errors, 0 warnings, 0 section mismatches -------------------------------------------------------------------------------- viper_defconfig (arm, gcc-10) — PASS, 0 errors, 0 warnings, 0 section mismatches -------------------------------------------------------------------------------- vt8500_v6_v7_defconfig (arm, gcc-10) — PASS, 0 errors, 0 warnings, 0 section mismatches -------------------------------------------------------------------------------- x86_64_defconfig (x86_64, gcc-10) — PASS, 0 errors, 3 warnings, 0 section mismatches Warnings: arch/x86/entry/entry_64.S:1738: Warning: no instruction mnemonic suffix given and no register operands; using default for `sysret' ld: arch/x86/boot/compressed/head_64.o: warning: relocation in read-only section `.head.text' ld: warning: creating DT_TEXTREL in a PIE -------------------------------------------------------------------------------- x86_64_defconfig+x86-chromebook (x86_64, gcc-10) — PASS, 0 errors, 3 warnings, 0 section mismatches Warnings: arch/x86/entry/entry_64.S:1738: Warning: no instruction mnemonic suffix given and no register operands; using default for `sysret' ld: arch/x86/boot/compressed/head_64.o: warning: relocation in read-only section `.head.text' ld: warning: creating DT_TEXTREL in a PIE -------------------------------------------------------------------------------- xcep_defconfig (arm, gcc-10) — PASS, 0 errors, 0 warnings, 0 section mismatches -------------------------------------------------------------------------------- zeus_defconfig (arm, gcc-10) — PASS, 0 errors, 0 warnings, 0 section mismatches -------------------------------------------------------------------------------- zx_defconfig (arm, gcc-10) — PASS, 0 errors, 0 warnings, 0 section mismatches --- For more info write to <info(a)kernelci.org>
3 years
1
0
0
0
net-next/master build: 208 builds: 3 failed, 205 passed, 6 errors, 277 warnings (v5.17-12862-gd717e4cae0fe)
by kernelci.org bot
net-next/master build: 208 builds: 3 failed, 205 passed, 6 errors, 277 warnings (v5.17-12862-gd717e4cae0fe) Full Build Summary:
https://kernelci.org/build/net-next/branch/master/kernel/v5.17-12862-gd717e…
Tree: net-next Branch: master Git Describe: v5.17-12862-gd717e4cae0fe Git Commit: d717e4cae0fe77e10a27e8545a967b8c379873ac Git URL:
https://git.kernel.org/pub/scm/linux/kernel/git/netdev/net-next.git
Built: 7 unique architectures Build Failures Detected: arm: imote2_defconfig: (gcc-10) FAIL rpc_defconfig: (gcc-10) FAIL mips: decstation_64_defconfig: (gcc-10) FAIL Errors and Warnings Detected: arc: arm64: arm: am200epdkit_defconfig (gcc-10): 4 warnings aspeed_g4_defconfig (gcc-10): 4 warnings assabet_defconfig (gcc-10): 4 warnings at91_dt_defconfig (gcc-10): 4 warnings axm55xx_defconfig (gcc-10): 4 warnings badge4_defconfig (gcc-10): 4 warnings cerfcube_defconfig (gcc-10): 4 warnings cm_x300_defconfig (gcc-10): 4 warnings colibri_pxa270_defconfig (gcc-10): 4 warnings colibri_pxa300_defconfig (gcc-10): 4 warnings collie_defconfig (gcc-10): 4 warnings corgi_defconfig (gcc-10): 4 warnings dove_defconfig (gcc-10): 4 warnings ep93xx_defconfig (gcc-10): 4 warnings eseries_pxa_defconfig (gcc-10): 4 warnings ezx_defconfig (gcc-10): 4 warnings footbridge_defconfig (gcc-10): 4 warnings h3600_defconfig (gcc-10): 4 warnings h5000_defconfig (gcc-10): 4 warnings hackkit_defconfig (gcc-10): 4 warnings hisi_defconfig (gcc-10): 4 warnings imote2_defconfig (gcc-10): 4 warnings imx_v4_v5_defconfig (gcc-10): 4 warnings iop32x_defconfig (gcc-10): 4 warnings ixp4xx_defconfig (gcc-10): 4 warnings jornada720_defconfig (gcc-10): 4 warnings lart_defconfig (gcc-10): 4 warnings lpc32xx_defconfig (gcc-10): 4 warnings lpd270_defconfig (gcc-10): 4 warnings lubbock_defconfig (gcc-10): 4 warnings magician_defconfig (gcc-10): 4 warnings mainstone_defconfig (gcc-10): 4 warnings mini2440_defconfig (gcc-10): 4 warnings mmp2_defconfig (gcc-10): 4 warnings moxart_defconfig (gcc-10): 4 warnings multi_v7_defconfig+CONFIG_SMP=n (gcc-10): 2 warnings mvebu_v5_defconfig (gcc-10): 4 warnings mvebu_v7_defconfig (gcc-10): 4 warnings mxs_defconfig (gcc-10): 4 warnings neponset_defconfig (gcc-10): 4 warnings netwinder_defconfig (gcc-10): 4 warnings omap1_defconfig (gcc-10): 4 warnings orion5x_defconfig (gcc-10): 4 warnings palmz72_defconfig (gcc-10): 4 warnings pcm027_defconfig (gcc-10): 4 warnings pleb_defconfig (gcc-10): 4 warnings pxa168_defconfig (gcc-10): 4 warnings pxa255-idp_defconfig (gcc-10): 4 warnings pxa3xx_defconfig (gcc-10): 4 warnings pxa910_defconfig (gcc-10): 4 warnings pxa_defconfig (gcc-10): 4 warnings rpc_defconfig (gcc-10): 2 errors s3c2410_defconfig (gcc-10): 4 warnings s3c6400_defconfig (gcc-10): 4 warnings s5pv210_defconfig (gcc-10): 4 warnings sama5_defconfig (gcc-10): 4 warnings shannon_defconfig (gcc-10): 4 warnings simpad_defconfig (gcc-10): 4 warnings socfpga_defconfig (gcc-10): 4 warnings spear13xx_defconfig (gcc-10): 4 warnings spear3xx_defconfig (gcc-10): 4 warnings spear6xx_defconfig (gcc-10): 4 warnings spitz_defconfig (gcc-10): 4 warnings tct_hammer_defconfig (gcc-10): 4 warnings trizeps4_defconfig (gcc-10): 4 warnings viper_defconfig (gcc-10): 4 warnings vt8500_v6_v7_defconfig (gcc-10): 4 warnings xcep_defconfig (gcc-10): 4 warnings zeus_defconfig (gcc-10): 4 warnings i386: mips: 32r2el_defconfig (gcc-10): 1 warning 32r2el_defconfig+debug (gcc-10): 1 warning 32r2el_defconfig+kselftest (gcc-10): 1 warning bcm47xx_defconfig (gcc-10): 1 warning fuloong2e_defconfig (gcc-10): 1 error lemote2f_defconfig (gcc-10): 1 error loongson2k_defconfig (gcc-10): 1 error loongson3_defconfig (gcc-10): 1 error rb532_defconfig (gcc-10): 1 warning riscv: x86_64: x86_64_defconfig+debug (gcc-10): 2 warnings Errors summary: 4 cc1: error: ‘-mloongson-mmi’ must be used with ‘-mhard-float’ 1 arch/arm/kernel/head.S:319: Error: missing expression -- `ldr r7,=0x' 1 arch/arm/kernel/head.S:319: Error: missing expression -- `ldr r3,=0x' Warnings summary: 67 arch/arm/mm/dma-mapping.c:405:42: warning: array subscript i is outside array bounds of ‘struct dma_contig_early_reserve[0]’ [-Warray-bounds] 67 arch/arm/mm/dma-mapping.c:404:36: warning: array subscript i is outside array bounds of ‘struct dma_contig_early_reserve[0]’ [-Warray-bounds] 67 arch/arm/mm/dma-mapping.c:396:15: warning: array subscript <unknown> is outside array bounds of ‘struct dma_contig_early_reserve[0]’ [-Warray-bounds] 67 arch/arm/mm/dma-mapping.c:395:15: warning: array subscript <unknown> is outside array bounds of ‘struct dma_contig_early_reserve[0]’ [-Warray-bounds] 3 arch/mips/boot/dts/img/boston.dts:128.19-178.5: Warning (pci_device_reg): /pci@14000000/pci2_root@0,0,0: PCI unit address format error, expected "0,0" 1 net/ipv6/ip6mr.c:1656:7: warning: unused variable ‘do_wrmifwhole’ [-Wunused-variable] 1 lib/strnlen_user.o: warning: objtool: strnlen_user()+0x59: call to do_strnlen_user() with UACCESS enabled 1 lib/strncpy_from_user.o: warning: objtool: strncpy_from_user()+0x86: call to do_strncpy_from_user() with UACCESS enabled 1 cc1: warning: result of ‘-117440512 << 16’ requires 44 bits to represent, but ‘int’ only has 32 bits [-Wshift-overflow=] 1 arch/arm/mach-vexpress/spc.c:592:18: warning: array subscript -1 is below array bounds of ‘bool[2]’ {aka ‘_Bool[2]’} [-Warray-bounds] 1 arch/arm/mach-vexpress/spc.c:583:21: warning: array subscript -1 is below array bounds of ‘bool[2]’ {aka ‘_Bool[2]’} [-Warray-bounds] ================================================================================ Detailed per-defconfig build reports: -------------------------------------------------------------------------------- 32r2el_defconfig (mips, gcc-10) — PASS, 0 errors, 1 warning, 0 section mismatches Warnings: arch/mips/boot/dts/img/boston.dts:128.19-178.5: Warning (pci_device_reg): /pci@14000000/pci2_root@0,0,0: PCI unit address format error, expected "0,0" -------------------------------------------------------------------------------- 32r2el_defconfig+debug (mips, gcc-10) — PASS, 0 errors, 1 warning, 0 section mismatches Warnings: arch/mips/boot/dts/img/boston.dts:128.19-178.5: Warning (pci_device_reg): /pci@14000000/pci2_root@0,0,0: PCI unit address format error, expected "0,0" -------------------------------------------------------------------------------- 32r2el_defconfig+kselftest (mips, gcc-10) — PASS, 0 errors, 1 warning, 0 section mismatches Warnings: arch/mips/boot/dts/img/boston.dts:128.19-178.5: Warning (pci_device_reg): /pci@14000000/pci2_root@0,0,0: PCI unit address format error, expected "0,0" -------------------------------------------------------------------------------- allnoconfig (arc, gcc-10) — PASS, 0 errors, 0 warnings, 0 section mismatches -------------------------------------------------------------------------------- allnoconfig (i386, gcc-10) — PASS, 0 errors, 0 warnings, 0 section mismatches -------------------------------------------------------------------------------- allnoconfig (x86_64, gcc-10) — PASS, 0 errors, 0 warnings, 0 section mismatches -------------------------------------------------------------------------------- am200epdkit_defconfig (arm, gcc-10) — PASS, 0 errors, 4 warnings, 0 section mismatches Warnings: arch/arm/mm/dma-mapping.c:395:15: warning: array subscript <unknown> is outside array bounds of ‘struct dma_contig_early_reserve[0]’ [-Warray-bounds] arch/arm/mm/dma-mapping.c:396:15: warning: array subscript <unknown> is outside array bounds of ‘struct dma_contig_early_reserve[0]’ [-Warray-bounds] arch/arm/mm/dma-mapping.c:404:36: warning: array subscript i is outside array bounds of ‘struct dma_contig_early_reserve[0]’ [-Warray-bounds] arch/arm/mm/dma-mapping.c:405:42: warning: array subscript i is outside array bounds of ‘struct dma_contig_early_reserve[0]’ [-Warray-bounds] -------------------------------------------------------------------------------- ar7_defconfig (mips, gcc-10) — PASS, 0 errors, 0 warnings, 0 section mismatches -------------------------------------------------------------------------------- aspeed_g4_defconfig (arm, gcc-10) — PASS, 0 errors, 4 warnings, 0 section mismatches Warnings: arch/arm/mm/dma-mapping.c:395:15: warning: array subscript <unknown> is outside array bounds of ‘struct dma_contig_early_reserve[0]’ [-Warray-bounds] arch/arm/mm/dma-mapping.c:396:15: warning: array subscript <unknown> is outside array bounds of ‘struct dma_contig_early_reserve[0]’ [-Warray-bounds] arch/arm/mm/dma-mapping.c:404:36: warning: array subscript i is outside array bounds of ‘struct dma_contig_early_reserve[0]’ [-Warray-bounds] arch/arm/mm/dma-mapping.c:405:42: warning: array subscript i is outside array bounds of ‘struct dma_contig_early_reserve[0]’ [-Warray-bounds] -------------------------------------------------------------------------------- aspeed_g5_defconfig (arm, gcc-10) — PASS, 0 errors, 0 warnings, 0 section mismatches -------------------------------------------------------------------------------- assabet_defconfig (arm, gcc-10) — PASS, 0 errors, 4 warnings, 0 section mismatches Warnings: arch/arm/mm/dma-mapping.c:395:15: warning: array subscript <unknown> is outside array bounds of ‘struct dma_contig_early_reserve[0]’ [-Warray-bounds] arch/arm/mm/dma-mapping.c:396:15: warning: array subscript <unknown> is outside array bounds of ‘struct dma_contig_early_reserve[0]’ [-Warray-bounds] arch/arm/mm/dma-mapping.c:404:36: warning: array subscript i is outside array bounds of ‘struct dma_contig_early_reserve[0]’ [-Warray-bounds] arch/arm/mm/dma-mapping.c:405:42: warning: array subscript i is outside array bounds of ‘struct dma_contig_early_reserve[0]’ [-Warray-bounds] -------------------------------------------------------------------------------- at91_dt_defconfig (arm, gcc-10) — PASS, 0 errors, 4 warnings, 0 section mismatches Warnings: arch/arm/mm/dma-mapping.c:395:15: warning: array subscript <unknown> is outside array bounds of ‘struct dma_contig_early_reserve[0]’ [-Warray-bounds] arch/arm/mm/dma-mapping.c:396:15: warning: array subscript <unknown> is outside array bounds of ‘struct dma_contig_early_reserve[0]’ [-Warray-bounds] arch/arm/mm/dma-mapping.c:404:36: warning: array subscript i is outside array bounds of ‘struct dma_contig_early_reserve[0]’ [-Warray-bounds] arch/arm/mm/dma-mapping.c:405:42: warning: array subscript i is outside array bounds of ‘struct dma_contig_early_reserve[0]’ [-Warray-bounds] -------------------------------------------------------------------------------- ath25_defconfig (mips, gcc-10) — PASS, 0 errors, 0 warnings, 0 section mismatches -------------------------------------------------------------------------------- ath79_defconfig (mips, gcc-10) — PASS, 0 errors, 0 warnings, 0 section mismatches -------------------------------------------------------------------------------- axm55xx_defconfig (arm, gcc-10) — PASS, 0 errors, 4 warnings, 0 section mismatches Warnings: arch/arm/mm/dma-mapping.c:395:15: warning: array subscript <unknown> is outside array bounds of ‘struct dma_contig_early_reserve[0]’ [-Warray-bounds] arch/arm/mm/dma-mapping.c:396:15: warning: array subscript <unknown> is outside array bounds of ‘struct dma_contig_early_reserve[0]’ [-Warray-bounds] arch/arm/mm/dma-mapping.c:404:36: warning: array subscript i is outside array bounds of ‘struct dma_contig_early_reserve[0]’ [-Warray-bounds] arch/arm/mm/dma-mapping.c:405:42: warning: array subscript i is outside array bounds of ‘struct dma_contig_early_reserve[0]’ [-Warray-bounds] -------------------------------------------------------------------------------- axs103_defconfig (arc, gcc-10) — PASS, 0 errors, 0 warnings, 0 section mismatches -------------------------------------------------------------------------------- axs103_smp_defconfig (arc, gcc-10) — PASS, 0 errors, 0 warnings, 0 section mismatches -------------------------------------------------------------------------------- badge4_defconfig (arm, gcc-10) — PASS, 0 errors, 4 warnings, 0 section mismatches Warnings: arch/arm/mm/dma-mapping.c:395:15: warning: array subscript <unknown> is outside array bounds of ‘struct dma_contig_early_reserve[0]’ [-Warray-bounds] arch/arm/mm/dma-mapping.c:396:15: warning: array subscript <unknown> is outside array bounds of ‘struct dma_contig_early_reserve[0]’ [-Warray-bounds] arch/arm/mm/dma-mapping.c:404:36: warning: array subscript i is outside array bounds of ‘struct dma_contig_early_reserve[0]’ [-Warray-bounds] arch/arm/mm/dma-mapping.c:405:42: warning: array subscript i is outside array bounds of ‘struct dma_contig_early_reserve[0]’ [-Warray-bounds] -------------------------------------------------------------------------------- bcm2835_defconfig (arm, gcc-10) — PASS, 0 errors, 0 warnings, 0 section mismatches -------------------------------------------------------------------------------- bcm47xx_defconfig (mips, gcc-10) — PASS, 0 errors, 1 warning, 0 section mismatches Warnings: net/ipv6/ip6mr.c:1656:7: warning: unused variable ‘do_wrmifwhole’ [-Wunused-variable] -------------------------------------------------------------------------------- bcm63xx_defconfig (mips, gcc-10) — PASS, 0 errors, 0 warnings, 0 section mismatches -------------------------------------------------------------------------------- bigsur_defconfig (mips, gcc-10) — PASS, 0 errors, 0 warnings, 0 section mismatches -------------------------------------------------------------------------------- bmips_be_defconfig (mips, gcc-10) — PASS, 0 errors, 0 warnings, 0 section mismatches -------------------------------------------------------------------------------- bmips_stb_defconfig (mips, gcc-10) — PASS, 0 errors, 0 warnings, 0 section mismatches -------------------------------------------------------------------------------- capcella_defconfig (mips, gcc-10) — PASS, 0 errors, 0 warnings, 0 section mismatches -------------------------------------------------------------------------------- cavium_octeon_defconfig (mips, gcc-10) — PASS, 0 errors, 0 warnings, 0 section mismatches -------------------------------------------------------------------------------- cerfcube_defconfig (arm, gcc-10) — PASS, 0 errors, 4 warnings, 0 section mismatches Warnings: arch/arm/mm/dma-mapping.c:395:15: warning: array subscript <unknown> is outside array bounds of ‘struct dma_contig_early_reserve[0]’ [-Warray-bounds] arch/arm/mm/dma-mapping.c:396:15: warning: array subscript <unknown> is outside array bounds of ‘struct dma_contig_early_reserve[0]’ [-Warray-bounds] arch/arm/mm/dma-mapping.c:404:36: warning: array subscript i is outside array bounds of ‘struct dma_contig_early_reserve[0]’ [-Warray-bounds] arch/arm/mm/dma-mapping.c:405:42: warning: array subscript i is outside array bounds of ‘struct dma_contig_early_reserve[0]’ [-Warray-bounds] -------------------------------------------------------------------------------- ci20_defconfig (mips, gcc-10) — PASS, 0 errors, 0 warnings, 0 section mismatches -------------------------------------------------------------------------------- cm_x300_defconfig (arm, gcc-10) — PASS, 0 errors, 4 warnings, 0 section mismatches Warnings: arch/arm/mm/dma-mapping.c:395:15: warning: array subscript <unknown> is outside array bounds of ‘struct dma_contig_early_reserve[0]’ [-Warray-bounds] arch/arm/mm/dma-mapping.c:396:15: warning: array subscript <unknown> is outside array bounds of ‘struct dma_contig_early_reserve[0]’ [-Warray-bounds] arch/arm/mm/dma-mapping.c:404:36: warning: array subscript i is outside array bounds of ‘struct dma_contig_early_reserve[0]’ [-Warray-bounds] arch/arm/mm/dma-mapping.c:405:42: warning: array subscript i is outside array bounds of ‘struct dma_contig_early_reserve[0]’ [-Warray-bounds] -------------------------------------------------------------------------------- cobalt_defconfig (mips, gcc-10) — PASS, 0 errors, 0 warnings, 0 section mismatches -------------------------------------------------------------------------------- colibri_pxa270_defconfig (arm, gcc-10) — PASS, 0 errors, 4 warnings, 0 section mismatches Warnings: arch/arm/mm/dma-mapping.c:395:15: warning: array subscript <unknown> is outside array bounds of ‘struct dma_contig_early_reserve[0]’ [-Warray-bounds] arch/arm/mm/dma-mapping.c:396:15: warning: array subscript <unknown> is outside array bounds of ‘struct dma_contig_early_reserve[0]’ [-Warray-bounds] arch/arm/mm/dma-mapping.c:404:36: warning: array subscript i is outside array bounds of ‘struct dma_contig_early_reserve[0]’ [-Warray-bounds] arch/arm/mm/dma-mapping.c:405:42: warning: array subscript i is outside array bounds of ‘struct dma_contig_early_reserve[0]’ [-Warray-bounds] -------------------------------------------------------------------------------- colibri_pxa300_defconfig (arm, gcc-10) — PASS, 0 errors, 4 warnings, 0 section mismatches Warnings: arch/arm/mm/dma-mapping.c:395:15: warning: array subscript <unknown> is outside array bounds of ‘struct dma_contig_early_reserve[0]’ [-Warray-bounds] arch/arm/mm/dma-mapping.c:396:15: warning: array subscript <unknown> is outside array bounds of ‘struct dma_contig_early_reserve[0]’ [-Warray-bounds] arch/arm/mm/dma-mapping.c:404:36: warning: array subscript i is outside array bounds of ‘struct dma_contig_early_reserve[0]’ [-Warray-bounds] arch/arm/mm/dma-mapping.c:405:42: warning: array subscript i is outside array bounds of ‘struct dma_contig_early_reserve[0]’ [-Warray-bounds] -------------------------------------------------------------------------------- collie_defconfig (arm, gcc-10) — PASS, 0 errors, 4 warnings, 0 section mismatches Warnings: arch/arm/mm/dma-mapping.c:395:15: warning: array subscript <unknown> is outside array bounds of ‘struct dma_contig_early_reserve[0]’ [-Warray-bounds] arch/arm/mm/dma-mapping.c:396:15: warning: array subscript <unknown> is outside array bounds of ‘struct dma_contig_early_reserve[0]’ [-Warray-bounds] arch/arm/mm/dma-mapping.c:404:36: warning: array subscript i is outside array bounds of ‘struct dma_contig_early_reserve[0]’ [-Warray-bounds] arch/arm/mm/dma-mapping.c:405:42: warning: array subscript i is outside array bounds of ‘struct dma_contig_early_reserve[0]’ [-Warray-bounds] -------------------------------------------------------------------------------- corgi_defconfig (arm, gcc-10) — PASS, 0 errors, 4 warnings, 0 section mismatches Warnings: arch/arm/mm/dma-mapping.c:395:15: warning: array subscript <unknown> is outside array bounds of ‘struct dma_contig_early_reserve[0]’ [-Warray-bounds] arch/arm/mm/dma-mapping.c:396:15: warning: array subscript <unknown> is outside array bounds of ‘struct dma_contig_early_reserve[0]’ [-Warray-bounds] arch/arm/mm/dma-mapping.c:404:36: warning: array subscript i is outside array bounds of ‘struct dma_contig_early_reserve[0]’ [-Warray-bounds] arch/arm/mm/dma-mapping.c:405:42: warning: array subscript i is outside array bounds of ‘struct dma_contig_early_reserve[0]’ [-Warray-bounds] -------------------------------------------------------------------------------- cu1000-neo_defconfig (mips, gcc-10) — PASS, 0 errors, 0 warnings, 0 section mismatches -------------------------------------------------------------------------------- cu1830-neo_defconfig (mips, gcc-10) — PASS, 0 errors, 0 warnings, 0 section mismatches -------------------------------------------------------------------------------- davinci_all_defconfig (arm, gcc-10) — PASS, 0 errors, 0 warnings, 0 section mismatches -------------------------------------------------------------------------------- db1xxx_defconfig (mips, gcc-10) — PASS, 0 errors, 0 warnings, 0 section mismatches -------------------------------------------------------------------------------- decstation_64_defconfig (mips, gcc-10) — FAIL, 0 errors, 0 warnings, 0 section mismatches -------------------------------------------------------------------------------- decstation_defconfig (mips, gcc-10) — PASS, 0 errors, 0 warnings, 0 section mismatches -------------------------------------------------------------------------------- decstation_r4k_defconfig (mips, gcc-10) — PASS, 0 errors, 0 warnings, 0 section mismatches -------------------------------------------------------------------------------- defconfig (riscv, gcc-10) — PASS, 0 errors, 0 warnings, 0 section mismatches -------------------------------------------------------------------------------- defconfig (arm64, gcc-10) — PASS, 0 errors, 0 warnings, 0 section mismatches -------------------------------------------------------------------------------- defconfig+CONFIG_CPU_BIG_ENDIAN=y (arm64, gcc-10) — PASS, 0 errors, 0 warnings, 0 section mismatches -------------------------------------------------------------------------------- defconfig+CONFIG_RANDOMIZE_BASE=y (arm64, gcc-10) — PASS, 0 errors, 0 warnings, 0 section mismatches -------------------------------------------------------------------------------- defconfig+arm64-chromebook (arm64, gcc-10) — PASS, 0 errors, 0 warnings, 0 section mismatches -------------------------------------------------------------------------------- defconfig+arm64-chromebook+kselftest (arm64, gcc-10) — PASS, 0 errors, 0 warnings, 0 section mismatches -------------------------------------------------------------------------------- defconfig+crypto (arm64, gcc-10) — PASS, 0 errors, 0 warnings, 0 section mismatches -------------------------------------------------------------------------------- defconfig+debug (riscv, gcc-10) — PASS, 0 errors, 0 warnings, 0 section mismatches -------------------------------------------------------------------------------- defconfig+debug (arm64, gcc-10) — PASS, 0 errors, 0 warnings, 0 section mismatches -------------------------------------------------------------------------------- defconfig+ima (arm64, gcc-10) — PASS, 0 errors, 0 warnings, 0 section mismatches -------------------------------------------------------------------------------- defconfig+kselftest (riscv, gcc-10) — PASS, 0 errors, 0 warnings, 0 section mismatches -------------------------------------------------------------------------------- defconfig+kselftest (arm64, gcc-10) — PASS, 0 errors, 0 warnings, 0 section mismatches -------------------------------------------------------------------------------- dove_defconfig (arm, gcc-10) — PASS, 0 errors, 4 warnings, 0 section mismatches Warnings: arch/arm/mm/dma-mapping.c:395:15: warning: array subscript <unknown> is outside array bounds of ‘struct dma_contig_early_reserve[0]’ [-Warray-bounds] arch/arm/mm/dma-mapping.c:396:15: warning: array subscript <unknown> is outside array bounds of ‘struct dma_contig_early_reserve[0]’ [-Warray-bounds] arch/arm/mm/dma-mapping.c:404:36: warning: array subscript i is outside array bounds of ‘struct dma_contig_early_reserve[0]’ [-Warray-bounds] arch/arm/mm/dma-mapping.c:405:42: warning: array subscript i is outside array bounds of ‘struct dma_contig_early_reserve[0]’ [-Warray-bounds] -------------------------------------------------------------------------------- e55_defconfig (mips, gcc-10) — PASS, 0 errors, 0 warnings, 0 section mismatches -------------------------------------------------------------------------------- ep93xx_defconfig (arm, gcc-10) — PASS, 0 errors, 4 warnings, 0 section mismatches Warnings: arch/arm/mm/dma-mapping.c:395:15: warning: array subscript <unknown> is outside array bounds of ‘struct dma_contig_early_reserve[0]’ [-Warray-bounds] arch/arm/mm/dma-mapping.c:396:15: warning: array subscript <unknown> is outside array bounds of ‘struct dma_contig_early_reserve[0]’ [-Warray-bounds] arch/arm/mm/dma-mapping.c:404:36: warning: array subscript i is outside array bounds of ‘struct dma_contig_early_reserve[0]’ [-Warray-bounds] arch/arm/mm/dma-mapping.c:405:42: warning: array subscript i is outside array bounds of ‘struct dma_contig_early_reserve[0]’ [-Warray-bounds] -------------------------------------------------------------------------------- eseries_pxa_defconfig (arm, gcc-10) — PASS, 0 errors, 4 warnings, 0 section mismatches Warnings: arch/arm/mm/dma-mapping.c:395:15: warning: array subscript <unknown> is outside array bounds of ‘struct dma_contig_early_reserve[0]’ [-Warray-bounds] arch/arm/mm/dma-mapping.c:396:15: warning: array subscript <unknown> is outside array bounds of ‘struct dma_contig_early_reserve[0]’ [-Warray-bounds] arch/arm/mm/dma-mapping.c:404:36: warning: array subscript i is outside array bounds of ‘struct dma_contig_early_reserve[0]’ [-Warray-bounds] arch/arm/mm/dma-mapping.c:405:42: warning: array subscript i is outside array bounds of ‘struct dma_contig_early_reserve[0]’ [-Warray-bounds] -------------------------------------------------------------------------------- exynos_defconfig (arm, gcc-10) — PASS, 0 errors, 0 warnings, 0 section mismatches -------------------------------------------------------------------------------- ezx_defconfig (arm, gcc-10) — PASS, 0 errors, 4 warnings, 0 section mismatches Warnings: arch/arm/mm/dma-mapping.c:395:15: warning: array subscript <unknown> is outside array bounds of ‘struct dma_contig_early_reserve[0]’ [-Warray-bounds] arch/arm/mm/dma-mapping.c:396:15: warning: array subscript <unknown> is outside array bounds of ‘struct dma_contig_early_reserve[0]’ [-Warray-bounds] arch/arm/mm/dma-mapping.c:404:36: warning: array subscript i is outside array bounds of ‘struct dma_contig_early_reserve[0]’ [-Warray-bounds] arch/arm/mm/dma-mapping.c:405:42: warning: array subscript i is outside array bounds of ‘struct dma_contig_early_reserve[0]’ [-Warray-bounds] -------------------------------------------------------------------------------- footbridge_defconfig (arm, gcc-10) — PASS, 0 errors, 4 warnings, 0 section mismatches Warnings: arch/arm/mm/dma-mapping.c:395:15: warning: array subscript <unknown> is outside array bounds of ‘struct dma_contig_early_reserve[0]’ [-Warray-bounds] arch/arm/mm/dma-mapping.c:396:15: warning: array subscript <unknown> is outside array bounds of ‘struct dma_contig_early_reserve[0]’ [-Warray-bounds] arch/arm/mm/dma-mapping.c:404:36: warning: array subscript i is outside array bounds of ‘struct dma_contig_early_reserve[0]’ [-Warray-bounds] arch/arm/mm/dma-mapping.c:405:42: warning: array subscript i is outside array bounds of ‘struct dma_contig_early_reserve[0]’ [-Warray-bounds] -------------------------------------------------------------------------------- fuloong2e_defconfig (mips, gcc-10) — PASS, 1 error, 0 warnings, 0 section mismatches Errors: cc1: error: ‘-mloongson-mmi’ must be used with ‘-mhard-float’ -------------------------------------------------------------------------------- gcw0_defconfig (mips, gcc-10) — PASS, 0 errors, 0 warnings, 0 section mismatches -------------------------------------------------------------------------------- gemini_defconfig (arm, gcc-10) — PASS, 0 errors, 0 warnings, 0 section mismatches -------------------------------------------------------------------------------- gpr_defconfig (mips, gcc-10) — PASS, 0 errors, 0 warnings, 0 section mismatches -------------------------------------------------------------------------------- h3600_defconfig (arm, gcc-10) — PASS, 0 errors, 4 warnings, 0 section mismatches Warnings: arch/arm/mm/dma-mapping.c:395:15: warning: array subscript <unknown> is outside array bounds of ‘struct dma_contig_early_reserve[0]’ [-Warray-bounds] arch/arm/mm/dma-mapping.c:396:15: warning: array subscript <unknown> is outside array bounds of ‘struct dma_contig_early_reserve[0]’ [-Warray-bounds] arch/arm/mm/dma-mapping.c:404:36: warning: array subscript i is outside array bounds of ‘struct dma_contig_early_reserve[0]’ [-Warray-bounds] arch/arm/mm/dma-mapping.c:405:42: warning: array subscript i is outside array bounds of ‘struct dma_contig_early_reserve[0]’ [-Warray-bounds] -------------------------------------------------------------------------------- h5000_defconfig (arm, gcc-10) — PASS, 0 errors, 4 warnings, 0 section mismatches Warnings: arch/arm/mm/dma-mapping.c:395:15: warning: array subscript <unknown> is outside array bounds of ‘struct dma_contig_early_reserve[0]’ [-Warray-bounds] arch/arm/mm/dma-mapping.c:396:15: warning: array subscript <unknown> is outside array bounds of ‘struct dma_contig_early_reserve[0]’ [-Warray-bounds] arch/arm/mm/dma-mapping.c:404:36: warning: array subscript i is outside array bounds of ‘struct dma_contig_early_reserve[0]’ [-Warray-bounds] arch/arm/mm/dma-mapping.c:405:42: warning: array subscript i is outside array bounds of ‘struct dma_contig_early_reserve[0]’ [-Warray-bounds] -------------------------------------------------------------------------------- hackkit_defconfig (arm, gcc-10) — PASS, 0 errors, 4 warnings, 0 section mismatches Warnings: arch/arm/mm/dma-mapping.c:395:15: warning: array subscript <unknown> is outside array bounds of ‘struct dma_contig_early_reserve[0]’ [-Warray-bounds] arch/arm/mm/dma-mapping.c:396:15: warning: array subscript <unknown> is outside array bounds of ‘struct dma_contig_early_reserve[0]’ [-Warray-bounds] arch/arm/mm/dma-mapping.c:404:36: warning: array subscript i is outside array bounds of ‘struct dma_contig_early_reserve[0]’ [-Warray-bounds] arch/arm/mm/dma-mapping.c:405:42: warning: array subscript i is outside array bounds of ‘struct dma_contig_early_reserve[0]’ [-Warray-bounds] -------------------------------------------------------------------------------- haps_hs_defconfig (arc, gcc-10) — PASS, 0 errors, 0 warnings, 0 section mismatches -------------------------------------------------------------------------------- haps_hs_smp_defconfig (arc, gcc-10) — PASS, 0 errors, 0 warnings, 0 section mismatches -------------------------------------------------------------------------------- haps_hs_smp_defconfig+debug (arc, gcc-10) — PASS, 0 errors, 0 warnings, 0 section mismatches -------------------------------------------------------------------------------- haps_hs_smp_defconfig+kselftest (arc, gcc-10) — PASS, 0 errors, 0 warnings, 0 section mismatches -------------------------------------------------------------------------------- hisi_defconfig (arm, gcc-10) — PASS, 0 errors, 4 warnings, 0 section mismatches Warnings: arch/arm/mm/dma-mapping.c:395:15: warning: array subscript <unknown> is outside array bounds of ‘struct dma_contig_early_reserve[0]’ [-Warray-bounds] arch/arm/mm/dma-mapping.c:396:15: warning: array subscript <unknown> is outside array bounds of ‘struct dma_contig_early_reserve[0]’ [-Warray-bounds] arch/arm/mm/dma-mapping.c:404:36: warning: array subscript i is outside array bounds of ‘struct dma_contig_early_reserve[0]’ [-Warray-bounds] arch/arm/mm/dma-mapping.c:405:42: warning: array subscript i is outside array bounds of ‘struct dma_contig_early_reserve[0]’ [-Warray-bounds] -------------------------------------------------------------------------------- hsdk_defconfig (arc, gcc-10) — PASS, 0 errors, 0 warnings, 0 section mismatches -------------------------------------------------------------------------------- i386_defconfig (i386, gcc-10) — PASS, 0 errors, 0 warnings, 0 section mismatches -------------------------------------------------------------------------------- i386_defconfig+debug (i386, gcc-10) — PASS, 0 errors, 0 warnings, 0 section mismatches -------------------------------------------------------------------------------- i386_defconfig+kselftest (i386, gcc-10) — PASS, 0 errors, 0 warnings, 0 section mismatches -------------------------------------------------------------------------------- imote2_defconfig (arm, gcc-10) — FAIL, 0 errors, 4 warnings, 0 section mismatches Warnings: arch/arm/mm/dma-mapping.c:395:15: warning: array subscript <unknown> is outside array bounds of ‘struct dma_contig_early_reserve[0]’ [-Warray-bounds] arch/arm/mm/dma-mapping.c:396:15: warning: array subscript <unknown> is outside array bounds of ‘struct dma_contig_early_reserve[0]’ [-Warray-bounds] arch/arm/mm/dma-mapping.c:404:36: warning: array subscript i is outside array bounds of ‘struct dma_contig_early_reserve[0]’ [-Warray-bounds] arch/arm/mm/dma-mapping.c:405:42: warning: array subscript i is outside array bounds of ‘struct dma_contig_early_reserve[0]’ [-Warray-bounds] -------------------------------------------------------------------------------- imx_v4_v5_defconfig (arm, gcc-10) — PASS, 0 errors, 4 warnings, 0 section mismatches Warnings: arch/arm/mm/dma-mapping.c:395:15: warning: array subscript <unknown> is outside array bounds of ‘struct dma_contig_early_reserve[0]’ [-Warray-bounds] arch/arm/mm/dma-mapping.c:396:15: warning: array subscript <unknown> is outside array bounds of ‘struct dma_contig_early_reserve[0]’ [-Warray-bounds] arch/arm/mm/dma-mapping.c:404:36: warning: array subscript i is outside array bounds of ‘struct dma_contig_early_reserve[0]’ [-Warray-bounds] arch/arm/mm/dma-mapping.c:405:42: warning: array subscript i is outside array bounds of ‘struct dma_contig_early_reserve[0]’ [-Warray-bounds] -------------------------------------------------------------------------------- imx_v6_v7_defconfig (arm, gcc-10) — PASS, 0 errors, 0 warnings, 0 section mismatches -------------------------------------------------------------------------------- integrator_defconfig (arm, gcc-10) — PASS, 0 errors, 0 warnings, 0 section mismatches -------------------------------------------------------------------------------- iop32x_defconfig (arm, gcc-10) — PASS, 0 errors, 4 warnings, 0 section mismatches Warnings: arch/arm/mm/dma-mapping.c:395:15: warning: array subscript <unknown> is outside array bounds of ‘struct dma_contig_early_reserve[0]’ [-Warray-bounds] arch/arm/mm/dma-mapping.c:396:15: warning: array subscript <unknown> is outside array bounds of ‘struct dma_contig_early_reserve[0]’ [-Warray-bounds] arch/arm/mm/dma-mapping.c:404:36: warning: array subscript i is outside array bounds of ‘struct dma_contig_early_reserve[0]’ [-Warray-bounds] arch/arm/mm/dma-mapping.c:405:42: warning: array subscript i is outside array bounds of ‘struct dma_contig_early_reserve[0]’ [-Warray-bounds] -------------------------------------------------------------------------------- ip22_defconfig (mips, gcc-10) — PASS, 0 errors, 0 warnings, 0 section mismatches -------------------------------------------------------------------------------- ip27_defconfig (mips, gcc-10) — PASS, 0 errors, 0 warnings, 0 section mismatches -------------------------------------------------------------------------------- ip28_defconfig (mips, gcc-10) — PASS, 0 errors, 0 warnings, 0 section mismatches -------------------------------------------------------------------------------- ip32_defconfig (mips, gcc-10) — PASS, 0 errors, 0 warnings, 0 section mismatches -------------------------------------------------------------------------------- ixp4xx_defconfig (arm, gcc-10) — PASS, 0 errors, 4 warnings, 0 section mismatches Warnings: arch/arm/mm/dma-mapping.c:395:15: warning: array subscript <unknown> is outside array bounds of ‘struct dma_contig_early_reserve[0]’ [-Warray-bounds] arch/arm/mm/dma-mapping.c:396:15: warning: array subscript <unknown> is outside array bounds of ‘struct dma_contig_early_reserve[0]’ [-Warray-bounds] arch/arm/mm/dma-mapping.c:404:36: warning: array subscript i is outside array bounds of ‘struct dma_contig_early_reserve[0]’ [-Warray-bounds] arch/arm/mm/dma-mapping.c:405:42: warning: array subscript i is outside array bounds of ‘struct dma_contig_early_reserve[0]’ [-Warray-bounds] -------------------------------------------------------------------------------- jazz_defconfig (mips, gcc-10) — PASS, 0 errors, 0 warnings, 0 section mismatches -------------------------------------------------------------------------------- jornada720_defconfig (arm, gcc-10) — PASS, 0 errors, 4 warnings, 0 section mismatches Warnings: arch/arm/mm/dma-mapping.c:395:15: warning: array subscript <unknown> is outside array bounds of ‘struct dma_contig_early_reserve[0]’ [-Warray-bounds] arch/arm/mm/dma-mapping.c:396:15: warning: array subscript <unknown> is outside array bounds of ‘struct dma_contig_early_reserve[0]’ [-Warray-bounds] arch/arm/mm/dma-mapping.c:404:36: warning: array subscript i is outside array bounds of ‘struct dma_contig_early_reserve[0]’ [-Warray-bounds] arch/arm/mm/dma-mapping.c:405:42: warning: array subscript i is outside array bounds of ‘struct dma_contig_early_reserve[0]’ [-Warray-bounds] -------------------------------------------------------------------------------- keystone_defconfig (arm, gcc-10) — PASS, 0 errors, 0 warnings, 0 section mismatches -------------------------------------------------------------------------------- lart_defconfig (arm, gcc-10) — PASS, 0 errors, 4 warnings, 0 section mismatches Warnings: arch/arm/mm/dma-mapping.c:395:15: warning: array subscript <unknown> is outside array bounds of ‘struct dma_contig_early_reserve[0]’ [-Warray-bounds] arch/arm/mm/dma-mapping.c:396:15: warning: array subscript <unknown> is outside array bounds of ‘struct dma_contig_early_reserve[0]’ [-Warray-bounds] arch/arm/mm/dma-mapping.c:404:36: warning: array subscript i is outside array bounds of ‘struct dma_contig_early_reserve[0]’ [-Warray-bounds] arch/arm/mm/dma-mapping.c:405:42: warning: array subscript i is outside array bounds of ‘struct dma_contig_early_reserve[0]’ [-Warray-bounds] -------------------------------------------------------------------------------- lemote2f_defconfig (mips, gcc-10) — PASS, 1 error, 0 warnings, 0 section mismatches Errors: cc1: error: ‘-mloongson-mmi’ must be used with ‘-mhard-float’ -------------------------------------------------------------------------------- loongson1b_defconfig (mips, gcc-10) — PASS, 0 errors, 0 warnings, 0 section mismatches -------------------------------------------------------------------------------- loongson1c_defconfig (mips, gcc-10) — PASS, 0 errors, 0 warnings, 0 section mismatches -------------------------------------------------------------------------------- loongson2k_defconfig (mips, gcc-10) — PASS, 1 error, 0 warnings, 0 section mismatches Errors: cc1: error: ‘-mloongson-mmi’ must be used with ‘-mhard-float’ -------------------------------------------------------------------------------- loongson3_defconfig (mips, gcc-10) — PASS, 1 error, 0 warnings, 0 section mismatches Errors: cc1: error: ‘-mloongson-mmi’ must be used with ‘-mhard-float’ -------------------------------------------------------------------------------- lpc18xx_defconfig (arm, gcc-10) — PASS, 0 errors, 0 warnings, 0 section mismatches -------------------------------------------------------------------------------- lpc32xx_defconfig (arm, gcc-10) — PASS, 0 errors, 4 warnings, 0 section mismatches Warnings: arch/arm/mm/dma-mapping.c:395:15: warning: array subscript <unknown> is outside array bounds of ‘struct dma_contig_early_reserve[0]’ [-Warray-bounds] arch/arm/mm/dma-mapping.c:396:15: warning: array subscript <unknown> is outside array bounds of ‘struct dma_contig_early_reserve[0]’ [-Warray-bounds] arch/arm/mm/dma-mapping.c:404:36: warning: array subscript i is outside array bounds of ‘struct dma_contig_early_reserve[0]’ [-Warray-bounds] arch/arm/mm/dma-mapping.c:405:42: warning: array subscript i is outside array bounds of ‘struct dma_contig_early_reserve[0]’ [-Warray-bounds] -------------------------------------------------------------------------------- lpd270_defconfig (arm, gcc-10) — PASS, 0 errors, 4 warnings, 0 section mismatches Warnings: arch/arm/mm/dma-mapping.c:395:15: warning: array subscript <unknown> is outside array bounds of ‘struct dma_contig_early_reserve[0]’ [-Warray-bounds] arch/arm/mm/dma-mapping.c:396:15: warning: array subscript <unknown> is outside array bounds of ‘struct dma_contig_early_reserve[0]’ [-Warray-bounds] arch/arm/mm/dma-mapping.c:404:36: warning: array subscript i is outside array bounds of ‘struct dma_contig_early_reserve[0]’ [-Warray-bounds] arch/arm/mm/dma-mapping.c:405:42: warning: array subscript i is outside array bounds of ‘struct dma_contig_early_reserve[0]’ [-Warray-bounds] -------------------------------------------------------------------------------- lubbock_defconfig (arm, gcc-10) — PASS, 0 errors, 4 warnings, 0 section mismatches Warnings: arch/arm/mm/dma-mapping.c:395:15: warning: array subscript <unknown> is outside array bounds of ‘struct dma_contig_early_reserve[0]’ [-Warray-bounds] arch/arm/mm/dma-mapping.c:396:15: warning: array subscript <unknown> is outside array bounds of ‘struct dma_contig_early_reserve[0]’ [-Warray-bounds] arch/arm/mm/dma-mapping.c:404:36: warning: array subscript i is outside array bounds of ‘struct dma_contig_early_reserve[0]’ [-Warray-bounds] arch/arm/mm/dma-mapping.c:405:42: warning: array subscript i is outside array bounds of ‘struct dma_contig_early_reserve[0]’ [-Warray-bounds] -------------------------------------------------------------------------------- magician_defconfig (arm, gcc-10) — PASS, 0 errors, 4 warnings, 0 section mismatches Warnings: arch/arm/mm/dma-mapping.c:395:15: warning: array subscript <unknown> is outside array bounds of ‘struct dma_contig_early_reserve[0]’ [-Warray-bounds] arch/arm/mm/dma-mapping.c:396:15: warning: array subscript <unknown> is outside array bounds of ‘struct dma_contig_early_reserve[0]’ [-Warray-bounds] arch/arm/mm/dma-mapping.c:404:36: warning: array subscript i is outside array bounds of ‘struct dma_contig_early_reserve[0]’ [-Warray-bounds] arch/arm/mm/dma-mapping.c:405:42: warning: array subscript i is outside array bounds of ‘struct dma_contig_early_reserve[0]’ [-Warray-bounds] -------------------------------------------------------------------------------- mainstone_defconfig (arm, gcc-10) — PASS, 0 errors, 4 warnings, 0 section mismatches Warnings: arch/arm/mm/dma-mapping.c:395:15: warning: array subscript <unknown> is outside array bounds of ‘struct dma_contig_early_reserve[0]’ [-Warray-bounds] arch/arm/mm/dma-mapping.c:396:15: warning: array subscript <unknown> is outside array bounds of ‘struct dma_contig_early_reserve[0]’ [-Warray-bounds] arch/arm/mm/dma-mapping.c:404:36: warning: array subscript i is outside array bounds of ‘struct dma_contig_early_reserve[0]’ [-Warray-bounds] arch/arm/mm/dma-mapping.c:405:42: warning: array subscript i is outside array bounds of ‘struct dma_contig_early_reserve[0]’ [-Warray-bounds] -------------------------------------------------------------------------------- malta_defconfig (mips, gcc-10) — PASS, 0 errors, 0 warnings, 0 section mismatches -------------------------------------------------------------------------------- malta_kvm_defconfig (mips, gcc-10) — PASS, 0 errors, 0 warnings, 0 section mismatches -------------------------------------------------------------------------------- malta_qemu_32r6_defconfig (mips, gcc-10) — PASS, 0 errors, 0 warnings, 0 section mismatches -------------------------------------------------------------------------------- maltaaprp_defconfig (mips, gcc-10) — PASS, 0 errors, 0 warnings, 0 section mismatches -------------------------------------------------------------------------------- maltasmvp_defconfig (mips, gcc-10) — PASS, 0 errors, 0 warnings, 0 section mismatches -------------------------------------------------------------------------------- maltasmvp_eva_defconfig (mips, gcc-10) — PASS, 0 errors, 0 warnings, 0 section mismatches -------------------------------------------------------------------------------- maltaup_defconfig (mips, gcc-10) — PASS, 0 errors, 0 warnings, 0 section mismatches -------------------------------------------------------------------------------- maltaup_xpa_defconfig (mips, gcc-10) — PASS, 0 errors, 0 warnings, 0 section mismatches -------------------------------------------------------------------------------- milbeaut_m10v_defconfig (arm, gcc-10) — PASS, 0 errors, 0 warnings, 0 section mismatches -------------------------------------------------------------------------------- mini2440_defconfig (arm, gcc-10) — PASS, 0 errors, 4 warnings, 0 section mismatches Warnings: arch/arm/mm/dma-mapping.c:395:15: warning: array subscript <unknown> is outside array bounds of ‘struct dma_contig_early_reserve[0]’ [-Warray-bounds] arch/arm/mm/dma-mapping.c:396:15: warning: array subscript <unknown> is outside array bounds of ‘struct dma_contig_early_reserve[0]’ [-Warray-bounds] arch/arm/mm/dma-mapping.c:404:36: warning: array subscript i is outside array bounds of ‘struct dma_contig_early_reserve[0]’ [-Warray-bounds] arch/arm/mm/dma-mapping.c:405:42: warning: array subscript i is outside array bounds of ‘struct dma_contig_early_reserve[0]’ [-Warray-bounds] -------------------------------------------------------------------------------- mmp2_defconfig (arm, gcc-10) — PASS, 0 errors, 4 warnings, 0 section mismatches Warnings: arch/arm/mm/dma-mapping.c:395:15: warning: array subscript <unknown> is outside array bounds of ‘struct dma_contig_early_reserve[0]’ [-Warray-bounds] arch/arm/mm/dma-mapping.c:396:15: warning: array subscript <unknown> is outside array bounds of ‘struct dma_contig_early_reserve[0]’ [-Warray-bounds] arch/arm/mm/dma-mapping.c:404:36: warning: array subscript i is outside array bounds of ‘struct dma_contig_early_reserve[0]’ [-Warray-bounds] arch/arm/mm/dma-mapping.c:405:42: warning: array subscript i is outside array bounds of ‘struct dma_contig_early_reserve[0]’ [-Warray-bounds] -------------------------------------------------------------------------------- moxart_defconfig (arm, gcc-10) — PASS, 0 errors, 4 warnings, 0 section mismatches Warnings: arch/arm/mm/dma-mapping.c:395:15: warning: array subscript <unknown> is outside array bounds of ‘struct dma_contig_early_reserve[0]’ [-Warray-bounds] arch/arm/mm/dma-mapping.c:396:15: warning: array subscript <unknown> is outside array bounds of ‘struct dma_contig_early_reserve[0]’ [-Warray-bounds] arch/arm/mm/dma-mapping.c:404:36: warning: array subscript i is outside array bounds of ‘struct dma_contig_early_reserve[0]’ [-Warray-bounds] arch/arm/mm/dma-mapping.c:405:42: warning: array subscript i is outside array bounds of ‘struct dma_contig_early_reserve[0]’ [-Warray-bounds] -------------------------------------------------------------------------------- mpc30x_defconfig (mips, gcc-10) — PASS, 0 errors, 0 warnings, 0 section mismatches -------------------------------------------------------------------------------- mps2_defconfig (arm, gcc-10) — PASS, 0 errors, 0 warnings, 0 section mismatches -------------------------------------------------------------------------------- mtx1_defconfig (mips, gcc-10) — PASS, 0 errors, 0 warnings, 0 section mismatches -------------------------------------------------------------------------------- multi_v4t_defconfig (arm, gcc-10) — PASS, 0 errors, 0 warnings, 0 section mismatches -------------------------------------------------------------------------------- multi_v5_defconfig (arm, gcc-10) — PASS, 0 errors, 0 warnings, 0 section mismatches -------------------------------------------------------------------------------- multi_v7_defconfig (arm, gcc-10) — PASS, 0 errors, 0 warnings, 0 section mismatches -------------------------------------------------------------------------------- multi_v7_defconfig+CONFIG_CPU_BIG_ENDIAN=y (arm, gcc-10) — PASS, 0 errors, 0 warnings, 0 section mismatches -------------------------------------------------------------------------------- multi_v7_defconfig+CONFIG_EFI=y+CONFIG_ARM_LPAE=y (arm, gcc-10) — PASS, 0 errors, 0 warnings, 0 section mismatches -------------------------------------------------------------------------------- multi_v7_defconfig+CONFIG_SMP=n (arm, gcc-10) — PASS, 0 errors, 2 warnings, 0 section mismatches Warnings: arch/arm/mach-vexpress/spc.c:583:21: warning: array subscript -1 is below array bounds of ‘bool[2]’ {aka ‘_Bool[2]’} [-Warray-bounds] arch/arm/mach-vexpress/spc.c:592:18: warning: array subscript -1 is below array bounds of ‘bool[2]’ {aka ‘_Bool[2]’} [-Warray-bounds] -------------------------------------------------------------------------------- multi_v7_defconfig+CONFIG_THUMB2_KERNEL=y (arm, gcc-10) — PASS, 0 errors, 0 warnings, 0 section mismatches -------------------------------------------------------------------------------- multi_v7_defconfig+crypto (arm, gcc-10) — PASS, 0 errors, 0 warnings, 0 section mismatches -------------------------------------------------------------------------------- multi_v7_defconfig+debug (arm, gcc-10) — PASS, 0 errors, 0 warnings, 0 section mismatches -------------------------------------------------------------------------------- multi_v7_defconfig+ima (arm, gcc-10) — PASS, 0 errors, 0 warnings, 0 section mismatches -------------------------------------------------------------------------------- multi_v7_defconfig+kselftest (arm, gcc-10) — PASS, 0 errors, 0 warnings, 0 section mismatches -------------------------------------------------------------------------------- mvebu_v5_defconfig (arm, gcc-10) — PASS, 0 errors, 4 warnings, 0 section mismatches Warnings: arch/arm/mm/dma-mapping.c:395:15: warning: array subscript <unknown> is outside array bounds of ‘struct dma_contig_early_reserve[0]’ [-Warray-bounds] arch/arm/mm/dma-mapping.c:396:15: warning: array subscript <unknown> is outside array bounds of ‘struct dma_contig_early_reserve[0]’ [-Warray-bounds] arch/arm/mm/dma-mapping.c:404:36: warning: array subscript i is outside array bounds of ‘struct dma_contig_early_reserve[0]’ [-Warray-bounds] arch/arm/mm/dma-mapping.c:405:42: warning: array subscript i is outside array bounds of ‘struct dma_contig_early_reserve[0]’ [-Warray-bounds] -------------------------------------------------------------------------------- mvebu_v7_defconfig (arm, gcc-10) — PASS, 0 errors, 4 warnings, 0 section mismatches Warnings: arch/arm/mm/dma-mapping.c:395:15: warning: array subscript <unknown> is outside array bounds of ‘struct dma_contig_early_reserve[0]’ [-Warray-bounds] arch/arm/mm/dma-mapping.c:396:15: warning: array subscript <unknown> is outside array bounds of ‘struct dma_contig_early_reserve[0]’ [-Warray-bounds] arch/arm/mm/dma-mapping.c:404:36: warning: array subscript i is outside array bounds of ‘struct dma_contig_early_reserve[0]’ [-Warray-bounds] arch/arm/mm/dma-mapping.c:405:42: warning: array subscript i is outside array bounds of ‘struct dma_contig_early_reserve[0]’ [-Warray-bounds] -------------------------------------------------------------------------------- mxs_defconfig (arm, gcc-10) — PASS, 0 errors, 4 warnings, 0 section mismatches Warnings: arch/arm/mm/dma-mapping.c:395:15: warning: array subscript <unknown> is outside array bounds of ‘struct dma_contig_early_reserve[0]’ [-Warray-bounds] arch/arm/mm/dma-mapping.c:396:15: warning: array subscript <unknown> is outside array bounds of ‘struct dma_contig_early_reserve[0]’ [-Warray-bounds] arch/arm/mm/dma-mapping.c:404:36: warning: array subscript i is outside array bounds of ‘struct dma_contig_early_reserve[0]’ [-Warray-bounds] arch/arm/mm/dma-mapping.c:405:42: warning: array subscript i is outside array bounds of ‘struct dma_contig_early_reserve[0]’ [-Warray-bounds] -------------------------------------------------------------------------------- neponset_defconfig (arm, gcc-10) — PASS, 0 errors, 4 warnings, 0 section mismatches Warnings: arch/arm/mm/dma-mapping.c:395:15: warning: array subscript <unknown> is outside array bounds of ‘struct dma_contig_early_reserve[0]’ [-Warray-bounds] arch/arm/mm/dma-mapping.c:396:15: warning: array subscript <unknown> is outside array bounds of ‘struct dma_contig_early_reserve[0]’ [-Warray-bounds] arch/arm/mm/dma-mapping.c:404:36: warning: array subscript i is outside array bounds of ‘struct dma_contig_early_reserve[0]’ [-Warray-bounds] arch/arm/mm/dma-mapping.c:405:42: warning: array subscript i is outside array bounds of ‘struct dma_contig_early_reserve[0]’ [-Warray-bounds] -------------------------------------------------------------------------------- netwinder_defconfig (arm, gcc-10) — PASS, 0 errors, 4 warnings, 0 section mismatches Warnings: arch/arm/mm/dma-mapping.c:395:15: warning: array subscript <unknown> is outside array bounds of ‘struct dma_contig_early_reserve[0]’ [-Warray-bounds] arch/arm/mm/dma-mapping.c:396:15: warning: array subscript <unknown> is outside array bounds of ‘struct dma_contig_early_reserve[0]’ [-Warray-bounds] arch/arm/mm/dma-mapping.c:404:36: warning: array subscript i is outside array bounds of ‘struct dma_contig_early_reserve[0]’ [-Warray-bounds] arch/arm/mm/dma-mapping.c:405:42: warning: array subscript i is outside array bounds of ‘struct dma_contig_early_reserve[0]’ [-Warray-bounds] -------------------------------------------------------------------------------- nhk8815_defconfig (arm, gcc-10) — PASS, 0 errors, 0 warnings, 0 section mismatches -------------------------------------------------------------------------------- nommu_k210_defconfig (riscv, gcc-10) — PASS, 0 errors, 0 warnings, 0 section mismatches -------------------------------------------------------------------------------- nommu_k210_sdcard_defconfig (riscv, gcc-10) — PASS, 0 errors, 0 warnings, 0 section mismatches -------------------------------------------------------------------------------- nsimosci_hs_defconfig (arc, gcc-10) — PASS, 0 errors, 0 warnings, 0 section mismatches -------------------------------------------------------------------------------- nsimosci_hs_smp_defconfig (arc, gcc-10) — PASS, 0 errors, 0 warnings, 0 section mismatches -------------------------------------------------------------------------------- omap1_defconfig (arm, gcc-10) — PASS, 0 errors, 4 warnings, 0 section mismatches Warnings: arch/arm/mm/dma-mapping.c:395:15: warning: array subscript <unknown> is outside array bounds of ‘struct dma_contig_early_reserve[0]’ [-Warray-bounds] arch/arm/mm/dma-mapping.c:396:15: warning: array subscript <unknown> is outside array bounds of ‘struct dma_contig_early_reserve[0]’ [-Warray-bounds] arch/arm/mm/dma-mapping.c:404:36: warning: array subscript i is outside array bounds of ‘struct dma_contig_early_reserve[0]’ [-Warray-bounds] arch/arm/mm/dma-mapping.c:405:42: warning: array subscript i is outside array bounds of ‘struct dma_contig_early_reserve[0]’ [-Warray-bounds] -------------------------------------------------------------------------------- omap2plus_defconfig (arm, gcc-10) — PASS, 0 errors, 0 warnings, 0 section mismatches -------------------------------------------------------------------------------- omega2p_defconfig (mips, gcc-10) — PASS, 0 errors, 0 warnings, 0 section mismatches -------------------------------------------------------------------------------- orion5x_defconfig (arm, gcc-10) — PASS, 0 errors, 4 warnings, 0 section mismatches Warnings: arch/arm/mm/dma-mapping.c:395:15: warning: array subscript <unknown> is outside array bounds of ‘struct dma_contig_early_reserve[0]’ [-Warray-bounds] arch/arm/mm/dma-mapping.c:396:15: warning: array subscript <unknown> is outside array bounds of ‘struct dma_contig_early_reserve[0]’ [-Warray-bounds] arch/arm/mm/dma-mapping.c:404:36: warning: array subscript i is outside array bounds of ‘struct dma_contig_early_reserve[0]’ [-Warray-bounds] arch/arm/mm/dma-mapping.c:405:42: warning: array subscript i is outside array bounds of ‘struct dma_contig_early_reserve[0]’ [-Warray-bounds] -------------------------------------------------------------------------------- oxnas_v6_defconfig (arm, gcc-10) — PASS, 0 errors, 0 warnings, 0 section mismatches -------------------------------------------------------------------------------- palmz72_defconfig (arm, gcc-10) — PASS, 0 errors, 4 warnings, 0 section mismatches Warnings: arch/arm/mm/dma-mapping.c:395:15: warning: array subscript <unknown> is outside array bounds of ‘struct dma_contig_early_reserve[0]’ [-Warray-bounds] arch/arm/mm/dma-mapping.c:396:15: warning: array subscript <unknown> is outside array bounds of ‘struct dma_contig_early_reserve[0]’ [-Warray-bounds] arch/arm/mm/dma-mapping.c:404:36: warning: array subscript i is outside array bounds of ‘struct dma_contig_early_reserve[0]’ [-Warray-bounds] arch/arm/mm/dma-mapping.c:405:42: warning: array subscript i is outside array bounds of ‘struct dma_contig_early_reserve[0]’ [-Warray-bounds] -------------------------------------------------------------------------------- pcm027_defconfig (arm, gcc-10) — PASS, 0 errors, 4 warnings, 0 section mismatches Warnings: arch/arm/mm/dma-mapping.c:395:15: warning: array subscript <unknown> is outside array bounds of ‘struct dma_contig_early_reserve[0]’ [-Warray-bounds] arch/arm/mm/dma-mapping.c:396:15: warning: array subscript <unknown> is outside array bounds of ‘struct dma_contig_early_reserve[0]’ [-Warray-bounds] arch/arm/mm/dma-mapping.c:404:36: warning: array subscript i is outside array bounds of ‘struct dma_contig_early_reserve[0]’ [-Warray-bounds] arch/arm/mm/dma-mapping.c:405:42: warning: array subscript i is outside array bounds of ‘struct dma_contig_early_reserve[0]’ [-Warray-bounds] -------------------------------------------------------------------------------- pic32mzda_defconfig (mips, gcc-10) — PASS, 0 errors, 0 warnings, 0 section mismatches -------------------------------------------------------------------------------- pleb_defconfig (arm, gcc-10) — PASS, 0 errors, 4 warnings, 0 section mismatches Warnings: arch/arm/mm/dma-mapping.c:395:15: warning: array subscript <unknown> is outside array bounds of ‘struct dma_contig_early_reserve[0]’ [-Warray-bounds] arch/arm/mm/dma-mapping.c:396:15: warning: array subscript <unknown> is outside array bounds of ‘struct dma_contig_early_reserve[0]’ [-Warray-bounds] arch/arm/mm/dma-mapping.c:404:36: warning: array subscript i is outside array bounds of ‘struct dma_contig_early_reserve[0]’ [-Warray-bounds] arch/arm/mm/dma-mapping.c:405:42: warning: array subscript i is outside array bounds of ‘struct dma_contig_early_reserve[0]’ [-Warray-bounds] -------------------------------------------------------------------------------- pxa168_defconfig (arm, gcc-10) — PASS, 0 errors, 4 warnings, 0 section mismatches Warnings: arch/arm/mm/dma-mapping.c:395:15: warning: array subscript <unknown> is outside array bounds of ‘struct dma_contig_early_reserve[0]’ [-Warray-bounds] arch/arm/mm/dma-mapping.c:396:15: warning: array subscript <unknown> is outside array bounds of ‘struct dma_contig_early_reserve[0]’ [-Warray-bounds] arch/arm/mm/dma-mapping.c:404:36: warning: array subscript i is outside array bounds of ‘struct dma_contig_early_reserve[0]’ [-Warray-bounds] arch/arm/mm/dma-mapping.c:405:42: warning: array subscript i is outside array bounds of ‘struct dma_contig_early_reserve[0]’ [-Warray-bounds] -------------------------------------------------------------------------------- pxa255-idp_defconfig (arm, gcc-10) — PASS, 0 errors, 4 warnings, 0 section mismatches Warnings: arch/arm/mm/dma-mapping.c:395:15: warning: array subscript <unknown> is outside array bounds of ‘struct dma_contig_early_reserve[0]’ [-Warray-bounds] arch/arm/mm/dma-mapping.c:396:15: warning: array subscript <unknown> is outside array bounds of ‘struct dma_contig_early_reserve[0]’ [-Warray-bounds] arch/arm/mm/dma-mapping.c:404:36: warning: array subscript i is outside array bounds of ‘struct dma_contig_early_reserve[0]’ [-Warray-bounds] arch/arm/mm/dma-mapping.c:405:42: warning: array subscript i is outside array bounds of ‘struct dma_contig_early_reserve[0]’ [-Warray-bounds] -------------------------------------------------------------------------------- pxa3xx_defconfig (arm, gcc-10) — PASS, 0 errors, 4 warnings, 0 section mismatches Warnings: arch/arm/mm/dma-mapping.c:395:15: warning: array subscript <unknown> is outside array bounds of ‘struct dma_contig_early_reserve[0]’ [-Warray-bounds] arch/arm/mm/dma-mapping.c:396:15: warning: array subscript <unknown> is outside array bounds of ‘struct dma_contig_early_reserve[0]’ [-Warray-bounds] arch/arm/mm/dma-mapping.c:404:36: warning: array subscript i is outside array bounds of ‘struct dma_contig_early_reserve[0]’ [-Warray-bounds] arch/arm/mm/dma-mapping.c:405:42: warning: array subscript i is outside array bounds of ‘struct dma_contig_early_reserve[0]’ [-Warray-bounds] -------------------------------------------------------------------------------- pxa910_defconfig (arm, gcc-10) — PASS, 0 errors, 4 warnings, 0 section mismatches Warnings: arch/arm/mm/dma-mapping.c:395:15: warning: array subscript <unknown> is outside array bounds of ‘struct dma_contig_early_reserve[0]’ [-Warray-bounds] arch/arm/mm/dma-mapping.c:396:15: warning: array subscript <unknown> is outside array bounds of ‘struct dma_contig_early_reserve[0]’ [-Warray-bounds] arch/arm/mm/dma-mapping.c:404:36: warning: array subscript i is outside array bounds of ‘struct dma_contig_early_reserve[0]’ [-Warray-bounds] arch/arm/mm/dma-mapping.c:405:42: warning: array subscript i is outside array bounds of ‘struct dma_contig_early_reserve[0]’ [-Warray-bounds] -------------------------------------------------------------------------------- pxa_defconfig (arm, gcc-10) — PASS, 0 errors, 4 warnings, 0 section mismatches Warnings: arch/arm/mm/dma-mapping.c:395:15: warning: array subscript <unknown> is outside array bounds of ‘struct dma_contig_early_reserve[0]’ [-Warray-bounds] arch/arm/mm/dma-mapping.c:396:15: warning: array subscript <unknown> is outside array bounds of ‘struct dma_contig_early_reserve[0]’ [-Warray-bounds] arch/arm/mm/dma-mapping.c:404:36: warning: array subscript i is outside array bounds of ‘struct dma_contig_early_reserve[0]’ [-Warray-bounds] arch/arm/mm/dma-mapping.c:405:42: warning: array subscript i is outside array bounds of ‘struct dma_contig_early_reserve[0]’ [-Warray-bounds] -------------------------------------------------------------------------------- qcom_defconfig (arm, gcc-10) — PASS, 0 errors, 0 warnings, 0 section mismatches -------------------------------------------------------------------------------- qi_lb60_defconfig (mips, gcc-10) — PASS, 0 errors, 0 warnings, 0 section mismatches -------------------------------------------------------------------------------- rb532_defconfig (mips, gcc-10) — PASS, 0 errors, 1 warning, 0 section mismatches Warnings: cc1: warning: result of ‘-117440512 << 16’ requires 44 bits to represent, but ‘int’ only has 32 bits [-Wshift-overflow=] -------------------------------------------------------------------------------- rbtx49xx_defconfig (mips, gcc-10) — PASS, 0 errors, 0 warnings, 0 section mismatches -------------------------------------------------------------------------------- realview_defconfig (arm, gcc-10) — PASS, 0 errors, 0 warnings, 0 section mismatches -------------------------------------------------------------------------------- rm200_defconfig (mips, gcc-10) — PASS, 0 errors, 0 warnings, 0 section mismatches -------------------------------------------------------------------------------- rpc_defconfig (arm, gcc-10) — FAIL, 2 errors, 0 warnings, 0 section mismatches Errors: arch/arm/kernel/head.S:319: Error: missing expression -- `ldr r7,=0x' arch/arm/kernel/head.S:319: Error: missing expression -- `ldr r3,=0x' -------------------------------------------------------------------------------- rs90_defconfig (mips, gcc-10) — PASS, 0 errors, 0 warnings, 0 section mismatches -------------------------------------------------------------------------------- rt305x_defconfig (mips, gcc-10) — PASS, 0 errors, 0 warnings, 0 section mismatches -------------------------------------------------------------------------------- rv32_defconfig (riscv, gcc-10) — PASS, 0 errors, 0 warnings, 0 section mismatches -------------------------------------------------------------------------------- s3c2410_defconfig (arm, gcc-10) — PASS, 0 errors, 4 warnings, 0 section mismatches Warnings: arch/arm/mm/dma-mapping.c:395:15: warning: array subscript <unknown> is outside array bounds of ‘struct dma_contig_early_reserve[0]’ [-Warray-bounds] arch/arm/mm/dma-mapping.c:396:15: warning: array subscript <unknown> is outside array bounds of ‘struct dma_contig_early_reserve[0]’ [-Warray-bounds] arch/arm/mm/dma-mapping.c:404:36: warning: array subscript i is outside array bounds of ‘struct dma_contig_early_reserve[0]’ [-Warray-bounds] arch/arm/mm/dma-mapping.c:405:42: warning: array subscript i is outside array bounds of ‘struct dma_contig_early_reserve[0]’ [-Warray-bounds] -------------------------------------------------------------------------------- s3c6400_defconfig (arm, gcc-10) — PASS, 0 errors, 4 warnings, 0 section mismatches Warnings: arch/arm/mm/dma-mapping.c:395:15: warning: array subscript <unknown> is outside array bounds of ‘struct dma_contig_early_reserve[0]’ [-Warray-bounds] arch/arm/mm/dma-mapping.c:396:15: warning: array subscript <unknown> is outside array bounds of ‘struct dma_contig_early_reserve[0]’ [-Warray-bounds] arch/arm/mm/dma-mapping.c:404:36: warning: array subscript i is outside array bounds of ‘struct dma_contig_early_reserve[0]’ [-Warray-bounds] arch/arm/mm/dma-mapping.c:405:42: warning: array subscript i is outside array bounds of ‘struct dma_contig_early_reserve[0]’ [-Warray-bounds] -------------------------------------------------------------------------------- s5pv210_defconfig (arm, gcc-10) — PASS, 0 errors, 4 warnings, 0 section mismatches Warnings: arch/arm/mm/dma-mapping.c:395:15: warning: array subscript <unknown> is outside array bounds of ‘struct dma_contig_early_reserve[0]’ [-Warray-bounds] arch/arm/mm/dma-mapping.c:396:15: warning: array subscript <unknown> is outside array bounds of ‘struct dma_contig_early_reserve[0]’ [-Warray-bounds] arch/arm/mm/dma-mapping.c:404:36: warning: array subscript i is outside array bounds of ‘struct dma_contig_early_reserve[0]’ [-Warray-bounds] arch/arm/mm/dma-mapping.c:405:42: warning: array subscript i is outside array bounds of ‘struct dma_contig_early_reserve[0]’ [-Warray-bounds] -------------------------------------------------------------------------------- sama5_defconfig (arm, gcc-10) — PASS, 0 errors, 4 warnings, 0 section mismatches Warnings: arch/arm/mm/dma-mapping.c:395:15: warning: array subscript <unknown> is outside array bounds of ‘struct dma_contig_early_reserve[0]’ [-Warray-bounds] arch/arm/mm/dma-mapping.c:396:15: warning: array subscript <unknown> is outside array bounds of ‘struct dma_contig_early_reserve[0]’ [-Warray-bounds] arch/arm/mm/dma-mapping.c:404:36: warning: array subscript i is outside array bounds of ‘struct dma_contig_early_reserve[0]’ [-Warray-bounds] arch/arm/mm/dma-mapping.c:405:42: warning: array subscript i is outside array bounds of ‘struct dma_contig_early_reserve[0]’ [-Warray-bounds] -------------------------------------------------------------------------------- sama7_defconfig (arm, gcc-10) — PASS, 0 errors, 0 warnings, 0 section mismatches -------------------------------------------------------------------------------- sb1250_swarm_defconfig (mips, gcc-10) — PASS, 0 errors, 0 warnings, 0 section mismatches -------------------------------------------------------------------------------- shannon_defconfig (arm, gcc-10) — PASS, 0 errors, 4 warnings, 0 section mismatches Warnings: arch/arm/mm/dma-mapping.c:395:15: warning: array subscript <unknown> is outside array bounds of ‘struct dma_contig_early_reserve[0]’ [-Warray-bounds] arch/arm/mm/dma-mapping.c:396:15: warning: array subscript <unknown> is outside array bounds of ‘struct dma_contig_early_reserve[0]’ [-Warray-bounds] arch/arm/mm/dma-mapping.c:404:36: warning: array subscript i is outside array bounds of ‘struct dma_contig_early_reserve[0]’ [-Warray-bounds] arch/arm/mm/dma-mapping.c:405:42: warning: array subscript i is outside array bounds of ‘struct dma_contig_early_reserve[0]’ [-Warray-bounds] -------------------------------------------------------------------------------- shmobile_defconfig (arm, gcc-10) — PASS, 0 errors, 0 warnings, 0 section mismatches -------------------------------------------------------------------------------- simpad_defconfig (arm, gcc-10) — PASS, 0 errors, 4 warnings, 0 section mismatches Warnings: arch/arm/mm/dma-mapping.c:395:15: warning: array subscript <unknown> is outside array bounds of ‘struct dma_contig_early_reserve[0]’ [-Warray-bounds] arch/arm/mm/dma-mapping.c:396:15: warning: array subscript <unknown> is outside array bounds of ‘struct dma_contig_early_reserve[0]’ [-Warray-bounds] arch/arm/mm/dma-mapping.c:404:36: warning: array subscript i is outside array bounds of ‘struct dma_contig_early_reserve[0]’ [-Warray-bounds] arch/arm/mm/dma-mapping.c:405:42: warning: array subscript i is outside array bounds of ‘struct dma_contig_early_reserve[0]’ [-Warray-bounds] -------------------------------------------------------------------------------- socfpga_defconfig (arm, gcc-10) — PASS, 0 errors, 4 warnings, 0 section mismatches Warnings: arch/arm/mm/dma-mapping.c:395:15: warning: array subscript <unknown> is outside array bounds of ‘struct dma_contig_early_reserve[0]’ [-Warray-bounds] arch/arm/mm/dma-mapping.c:396:15: warning: array subscript <unknown> is outside array bounds of ‘struct dma_contig_early_reserve[0]’ [-Warray-bounds] arch/arm/mm/dma-mapping.c:404:36: warning: array subscript i is outside array bounds of ‘struct dma_contig_early_reserve[0]’ [-Warray-bounds] arch/arm/mm/dma-mapping.c:405:42: warning: array subscript i is outside array bounds of ‘struct dma_contig_early_reserve[0]’ [-Warray-bounds] -------------------------------------------------------------------------------- spear13xx_defconfig (arm, gcc-10) — PASS, 0 errors, 4 warnings, 0 section mismatches Warnings: arch/arm/mm/dma-mapping.c:395:15: warning: array subscript <unknown> is outside array bounds of ‘struct dma_contig_early_reserve[0]’ [-Warray-bounds] arch/arm/mm/dma-mapping.c:396:15: warning: array subscript <unknown> is outside array bounds of ‘struct dma_contig_early_reserve[0]’ [-Warray-bounds] arch/arm/mm/dma-mapping.c:404:36: warning: array subscript i is outside array bounds of ‘struct dma_contig_early_reserve[0]’ [-Warray-bounds] arch/arm/mm/dma-mapping.c:405:42: warning: array subscript i is outside array bounds of ‘struct dma_contig_early_reserve[0]’ [-Warray-bounds] -------------------------------------------------------------------------------- spear3xx_defconfig (arm, gcc-10) — PASS, 0 errors, 4 warnings, 0 section mismatches Warnings: arch/arm/mm/dma-mapping.c:395:15: warning: array subscript <unknown> is outside array bounds of ‘struct dma_contig_early_reserve[0]’ [-Warray-bounds] arch/arm/mm/dma-mapping.c:396:15: warning: array subscript <unknown> is outside array bounds of ‘struct dma_contig_early_reserve[0]’ [-Warray-bounds] arch/arm/mm/dma-mapping.c:404:36: warning: array subscript i is outside array bounds of ‘struct dma_contig_early_reserve[0]’ [-Warray-bounds] arch/arm/mm/dma-mapping.c:405:42: warning: array subscript i is outside array bounds of ‘struct dma_contig_early_reserve[0]’ [-Warray-bounds] -------------------------------------------------------------------------------- spear6xx_defconfig (arm, gcc-10) — PASS, 0 errors, 4 warnings, 0 section mismatches Warnings: arch/arm/mm/dma-mapping.c:395:15: warning: array subscript <unknown> is outside array bounds of ‘struct dma_contig_early_reserve[0]’ [-Warray-bounds] arch/arm/mm/dma-mapping.c:396:15: warning: array subscript <unknown> is outside array bounds of ‘struct dma_contig_early_reserve[0]’ [-Warray-bounds] arch/arm/mm/dma-mapping.c:404:36: warning: array subscript i is outside array bounds of ‘struct dma_contig_early_reserve[0]’ [-Warray-bounds] arch/arm/mm/dma-mapping.c:405:42: warning: array subscript i is outside array bounds of ‘struct dma_contig_early_reserve[0]’ [-Warray-bounds] -------------------------------------------------------------------------------- spitz_defconfig (arm, gcc-10) — PASS, 0 errors, 4 warnings, 0 section mismatches Warnings: arch/arm/mm/dma-mapping.c:395:15: warning: array subscript <unknown> is outside array bounds of ‘struct dma_contig_early_reserve[0]’ [-Warray-bounds] arch/arm/mm/dma-mapping.c:396:15: warning: array subscript <unknown> is outside array bounds of ‘struct dma_contig_early_reserve[0]’ [-Warray-bounds] arch/arm/mm/dma-mapping.c:404:36: warning: array subscript i is outside array bounds of ‘struct dma_contig_early_reserve[0]’ [-Warray-bounds] arch/arm/mm/dma-mapping.c:405:42: warning: array subscript i is outside array bounds of ‘struct dma_contig_early_reserve[0]’ [-Warray-bounds] -------------------------------------------------------------------------------- stm32_defconfig (arm, gcc-10) — PASS, 0 errors, 0 warnings, 0 section mismatches -------------------------------------------------------------------------------- sunxi_defconfig (arm, gcc-10) — PASS, 0 errors, 0 warnings, 0 section mismatches -------------------------------------------------------------------------------- tb0219_defconfig (mips, gcc-10) — PASS, 0 errors, 0 warnings, 0 section mismatches -------------------------------------------------------------------------------- tb0226_defconfig (mips, gcc-10) — PASS, 0 errors, 0 warnings, 0 section mismatches -------------------------------------------------------------------------------- tb0287_defconfig (mips, gcc-10) — PASS, 0 errors, 0 warnings, 0 section mismatches -------------------------------------------------------------------------------- tct_hammer_defconfig (arm, gcc-10) — PASS, 0 errors, 4 warnings, 0 section mismatches Warnings: arch/arm/mm/dma-mapping.c:395:15: warning: array subscript <unknown> is outside array bounds of ‘struct dma_contig_early_reserve[0]’ [-Warray-bounds] arch/arm/mm/dma-mapping.c:396:15: warning: array subscript <unknown> is outside array bounds of ‘struct dma_contig_early_reserve[0]’ [-Warray-bounds] arch/arm/mm/dma-mapping.c:404:36: warning: array subscript i is outside array bounds of ‘struct dma_contig_early_reserve[0]’ [-Warray-bounds] arch/arm/mm/dma-mapping.c:405:42: warning: array subscript i is outside array bounds of ‘struct dma_contig_early_reserve[0]’ [-Warray-bounds] -------------------------------------------------------------------------------- tegra_defconfig (arm, gcc-10) — PASS, 0 errors, 0 warnings, 0 section mismatches -------------------------------------------------------------------------------- tinyconfig (i386, gcc-10) — PASS, 0 errors, 0 warnings, 0 section mismatches -------------------------------------------------------------------------------- tinyconfig (x86_64, gcc-10) — PASS, 0 errors, 0 warnings, 0 section mismatches -------------------------------------------------------------------------------- tinyconfig (arc, gcc-10) — PASS, 0 errors, 0 warnings, 0 section mismatches -------------------------------------------------------------------------------- trizeps4_defconfig (arm, gcc-10) — PASS, 0 errors, 4 warnings, 0 section mismatches Warnings: arch/arm/mm/dma-mapping.c:395:15: warning: array subscript <unknown> is outside array bounds of ‘struct dma_contig_early_reserve[0]’ [-Warray-bounds] arch/arm/mm/dma-mapping.c:396:15: warning: array subscript <unknown> is outside array bounds of ‘struct dma_contig_early_reserve[0]’ [-Warray-bounds] arch/arm/mm/dma-mapping.c:404:36: warning: array subscript i is outside array bounds of ‘struct dma_contig_early_reserve[0]’ [-Warray-bounds] arch/arm/mm/dma-mapping.c:405:42: warning: array subscript i is outside array bounds of ‘struct dma_contig_early_reserve[0]’ [-Warray-bounds] -------------------------------------------------------------------------------- u8500_defconfig (arm, gcc-10) — PASS, 0 errors, 0 warnings, 0 section mismatches -------------------------------------------------------------------------------- vdk_hs38_defconfig (arc, gcc-10) — PASS, 0 errors, 0 warnings, 0 section mismatches -------------------------------------------------------------------------------- vdk_hs38_smp_defconfig (arc, gcc-10) — PASS, 0 errors, 0 warnings, 0 section mismatches -------------------------------------------------------------------------------- versatile_defconfig (arm, gcc-10) — PASS, 0 errors, 0 warnings, 0 section mismatches -------------------------------------------------------------------------------- vexpress_defconfig (arm, gcc-10) — PASS, 0 errors, 0 warnings, 0 section mismatches -------------------------------------------------------------------------------- vf610m4_defconfig (arm, gcc-10) — PASS, 0 errors, 0 warnings, 0 section mismatches -------------------------------------------------------------------------------- viper_defconfig (arm, gcc-10) — PASS, 0 errors, 4 warnings, 0 section mismatches Warnings: arch/arm/mm/dma-mapping.c:395:15: warning: array subscript <unknown> is outside array bounds of ‘struct dma_contig_early_reserve[0]’ [-Warray-bounds] arch/arm/mm/dma-mapping.c:396:15: warning: array subscript <unknown> is outside array bounds of ‘struct dma_contig_early_reserve[0]’ [-Warray-bounds] arch/arm/mm/dma-mapping.c:404:36: warning: array subscript i is outside array bounds of ‘struct dma_contig_early_reserve[0]’ [-Warray-bounds] arch/arm/mm/dma-mapping.c:405:42: warning: array subscript i is outside array bounds of ‘struct dma_contig_early_reserve[0]’ [-Warray-bounds] -------------------------------------------------------------------------------- vocore2_defconfig (mips, gcc-10) — PASS, 0 errors, 0 warnings, 0 section mismatches -------------------------------------------------------------------------------- vt8500_v6_v7_defconfig (arm, gcc-10) — PASS, 0 errors, 4 warnings, 0 section mismatches Warnings: arch/arm/mm/dma-mapping.c:395:15: warning: array subscript <unknown> is outside array bounds of ‘struct dma_contig_early_reserve[0]’ [-Warray-bounds] arch/arm/mm/dma-mapping.c:396:15: warning: array subscript <unknown> is outside array bounds of ‘struct dma_contig_early_reserve[0]’ [-Warray-bounds] arch/arm/mm/dma-mapping.c:404:36: warning: array subscript i is outside array bounds of ‘struct dma_contig_early_reserve[0]’ [-Warray-bounds] arch/arm/mm/dma-mapping.c:405:42: warning: array subscript i is outside array bounds of ‘struct dma_contig_early_reserve[0]’ [-Warray-bounds] -------------------------------------------------------------------------------- workpad_defconfig (mips, gcc-10) — PASS, 0 errors, 0 warnings, 0 section mismatches -------------------------------------------------------------------------------- x86_64_defconfig (x86_64, gcc-10) — PASS, 0 errors, 0 warnings, 0 section mismatches -------------------------------------------------------------------------------- x86_64_defconfig+amdgpu (x86_64, gcc-10) — PASS, 0 errors, 0 warnings, 0 section mismatches -------------------------------------------------------------------------------- x86_64_defconfig+crypto (x86_64, gcc-10) — PASS, 0 errors, 0 warnings, 0 section mismatches -------------------------------------------------------------------------------- x86_64_defconfig+debug (x86_64, gcc-10) — PASS, 0 errors, 2 warnings, 0 section mismatches Warnings: lib/strncpy_from_user.o: warning: objtool: strncpy_from_user()+0x86: call to do_strncpy_from_user() with UACCESS enabled lib/strnlen_user.o: warning: objtool: strnlen_user()+0x59: call to do_strnlen_user() with UACCESS enabled -------------------------------------------------------------------------------- x86_64_defconfig+ima (x86_64, gcc-10) — PASS, 0 errors, 0 warnings, 0 section mismatches -------------------------------------------------------------------------------- x86_64_defconfig+kselftest (x86_64, gcc-10) — PASS, 0 errors, 0 warnings, 0 section mismatches -------------------------------------------------------------------------------- x86_64_defconfig+x86-chromebook (x86_64, gcc-10) — PASS, 0 errors, 0 warnings, 0 section mismatches -------------------------------------------------------------------------------- x86_64_defconfig+x86-chromebook+amdgpu (x86_64, gcc-10) — PASS, 0 errors, 0 warnings, 0 section mismatches -------------------------------------------------------------------------------- x86_64_defconfig+x86-chromebook+kselftest (x86_64, gcc-10) — PASS, 0 errors, 0 warnings, 0 section mismatches -------------------------------------------------------------------------------- x86_64_defconfig+x86_kvm_guest (x86_64, gcc-10) — PASS, 0 errors, 0 warnings, 0 section mismatches -------------------------------------------------------------------------------- xcep_defconfig (arm, gcc-10) — PASS, 0 errors, 4 warnings, 0 section mismatches Warnings: arch/arm/mm/dma-mapping.c:395:15: warning: array subscript <unknown> is outside array bounds of ‘struct dma_contig_early_reserve[0]’ [-Warray-bounds] arch/arm/mm/dma-mapping.c:396:15: warning: array subscript <unknown> is outside array bounds of ‘struct dma_contig_early_reserve[0]’ [-Warray-bounds] arch/arm/mm/dma-mapping.c:404:36: warning: array subscript i is outside array bounds of ‘struct dma_contig_early_reserve[0]’ [-Warray-bounds] arch/arm/mm/dma-mapping.c:405:42: warning: array subscript i is outside array bounds of ‘struct dma_contig_early_reserve[0]’ [-Warray-bounds] -------------------------------------------------------------------------------- zeus_defconfig (arm, gcc-10) — PASS, 0 errors, 4 warnings, 0 section mismatches Warnings: arch/arm/mm/dma-mapping.c:395:15: warning: array subscript <unknown> is outside array bounds of ‘struct dma_contig_early_reserve[0]’ [-Warray-bounds] arch/arm/mm/dma-mapping.c:396:15: warning: array subscript <unknown> is outside array bounds of ‘struct dma_contig_early_reserve[0]’ [-Warray-bounds] arch/arm/mm/dma-mapping.c:404:36: warning: array subscript i is outside array bounds of ‘struct dma_contig_early_reserve[0]’ [-Warray-bounds] arch/arm/mm/dma-mapping.c:405:42: warning: array subscript i is outside array bounds of ‘struct dma_contig_early_reserve[0]’ [-Warray-bounds] --- For more info write to <info(a)kernelci.org>
3 years
1
0
0
0
mainline/master baseline: 585 runs, 3 regressions (v5.17-12882-g1930a6e739c4b)
by kernelci.org bot
mainline/master baseline: 585 runs, 3 regressions (v5.17-12882-g1930a6e739c4b) Regressions Summary ------------------- platform | arch | lab | compiler | defconfig | regressions ------------------------+-------+-------------+----------+------------------------------+------------ imx8mn-ddr4-evk | arm64 | lab-nxp | clang-11 | defconfig+CON..._64K_PAGES=y | 1 kontron-pitx-imx8m | arm64 | lab-kontron | clang-11 | defconfig | 1 sun50i-a64-bananapi-m64 | arm64 | lab-clabbe | clang-13 | defconfig | 1 Details:
https://kernelci.org/test/job/mainline/branch/master/kernel/v5.17-12882-g19…
Test: baseline Tree: mainline Branch: master Describe: v5.17-12882-g1930a6e739c4b URL:
https://git.kernel.org/pub/scm/linux/kernel/git/torvalds/linux.git
SHA: 1930a6e739c4b4a654a69164dbe39e554d228915 Test Regressions ---------------- platform | arch | lab | compiler | defconfig | regressions ------------------------+-------+-------------+----------+------------------------------+------------ imx8mn-ddr4-evk | arm64 | lab-nxp | clang-11 | defconfig+CON..._64K_PAGES=y | 1 Details:
https://kernelci.org/test/plan/id/624267703dd9055bcbae068e
Results: 0 PASS, 1 FAIL, 0 SKIP Full config: defconfig+CONFIG_ARM64_64K_PAGES=y Compiler: clang-11 (Debian clang version 11.0.1-2) Plain log:
https://storage.kernelci.org//mainline/master/v5.17-12882-g1930a6e739c4b/ar…
HTML log:
https://storage.kernelci.org//mainline/master/v5.17-12882-g1930a6e739c4b/ar…
Rootfs:
http://storage.kernelci.org/images/rootfs/buildroot/buildroot-baseline/2022…
* baseline.login:
https://kernelci.org/test/case/id/624267703dd9055bcbae068f
new failure (last pass: v5.17-11407-gae085d7f9365d) platform | arch | lab | compiler | defconfig | regressions ------------------------+-------+-------------+----------+------------------------------+------------ kontron-pitx-imx8m | arm64 | lab-kontron | clang-11 | defconfig | 1 Details:
https://kernelci.org/test/plan/id/624268313e4885b86fae0688
Results: 51 PASS, 1 FAIL, 1 SKIP Full config: defconfig Compiler: clang-11 (Debian clang version 11.0.1-2) Plain log:
https://storage.kernelci.org//mainline/master/v5.17-12882-g1930a6e739c4b/ar…
HTML log:
https://storage.kernelci.org//mainline/master/v5.17-12882-g1930a6e739c4b/ar…
Rootfs:
http://storage.kernelci.org/images/rootfs/buildroot/buildroot-baseline/2022…
* baseline.bootrr.dwc3-usb1-probed:
https://kernelci.org/test/case/id/624268313e4885b86fae069b
new failure (last pass: v5.17-11407-gae085d7f9365d) 2022-03-29T01:59:57.863150 /lava-103665/1/../bin/lava-test-case 2022-03-29T01:59:57.863477 <8>[ 13.644277] <LAVA_SIGNAL_TESTCASE TEST_CASE_ID=dwc3-usb1-probed RESULT=fail> 2022-03-29T01:59:57.863655 /lava-103665/1/../bin/lava-test-case 2022-03-29T01:59:57.863820 <8>[ 13.663810] <LAVA_SIGNAL_TESTCASE TEST_CASE_ID=imx8mq-usb-phy-driver-present RESULT=pass> platform | arch | lab | compiler | defconfig | regressions ------------------------+-------+-------------+----------+------------------------------+------------ sun50i-a64-bananapi-m64 | arm64 | lab-clabbe | clang-13 | defconfig | 1 Details:
https://kernelci.org/test/plan/id/62426553b7e4f81d3bae067e
Results: 0 PASS, 1 FAIL, 0 SKIP Full config: defconfig Compiler: clang-13 (Debian clang version 13.0.1-++20220126092033+75e33f71c2da-1~exp1~20220126212112.63) Plain log:
https://storage.kernelci.org//mainline/master/v5.17-12882-g1930a6e739c4b/ar…
HTML log:
https://storage.kernelci.org//mainline/master/v5.17-12882-g1930a6e739c4b/ar…
Rootfs:
http://storage.kernelci.org/images/rootfs/buildroot/buildroot-baseline/2022…
* baseline.login:
https://kernelci.org/test/case/id/62426553b7e4f81d3bae067f
new failure (last pass: v5.17-11407-gae085d7f9365d)
3 years
1
0
0
0
next/pending-fixes baseline: 329 runs, 5 regressions (v5.17-12935-gafa5b5041c02)
by kernelci.org bot
next/pending-fixes baseline: 329 runs, 5 regressions (v5.17-12935-gafa5b5041c02) Regressions Summary ------------------- platform | arch | lab | compiler | defconfig | regressions --------------------------+--------+---------------+----------+------------------------------+------------ asus-C523NA-A20057-coral | x86_64 | lab-collabora | gcc-10 | x86_64_defcon...ebook+amdgpu | 1 asus-C523NA-A20057-coral | x86_64 | lab-collabora | gcc-10 | x86_64_defcon...6-chromebook | 1 hp-x360-12b-n4000-octopus | x86_64 | lab-collabora | gcc-10 | x86_64_defcon...ebook+amdgpu | 1 hp-x360-12b-n4000-octopus | x86_64 | lab-collabora | gcc-10 | x86_64_defcon...6-chromebook | 1 sun50i-a64-bananapi-m64 | arm64 | lab-clabbe | gcc-10 | defconfig+CON...OMIZE_BASE=y | 1 Details:
https://kernelci.org/test/job/next/branch/pending-fixes/kernel/v5.17-12935-…
Test: baseline Tree: next Branch: pending-fixes Describe: v5.17-12935-gafa5b5041c02 URL:
https://git.kernel.org/pub/scm/linux/kernel/git/next/linux-next.git
SHA: afa5b5041c02d7d802e884511e7fa8a65c67abfc Test Regressions ---------------- platform | arch | lab | compiler | defconfig | regressions --------------------------+--------+---------------+----------+------------------------------+------------ asus-C523NA-A20057-coral | x86_64 | lab-collabora | gcc-10 | x86_64_defcon...ebook+amdgpu | 1 Details:
https://kernelci.org/test/plan/id/62426f80ddd2462f47ae067c
Results: 0 PASS, 1 FAIL, 0 SKIP Full config: x86_64_defconfig+x86-chromebook+amdgpu Compiler: gcc-10 (gcc (Debian 10.2.1-6) 10.2.1 20210110) Plain log:
https://storage.kernelci.org//next/pending-fixes/v5.17-12935-gafa5b5041c02/…
HTML log:
https://storage.kernelci.org//next/pending-fixes/v5.17-12935-gafa5b5041c02/…
Rootfs:
http://storage.kernelci.org/images/rootfs/buildroot/buildroot-baseline/2022…
* baseline.login:
https://kernelci.org/test/case/id/62426f80ddd2462f47ae067d
failing since 13 days (last pass: v5.17-rc7-220-g483b57a0f972, first fail: v5.17-rc8-96-g702087d7e205) platform | arch | lab | compiler | defconfig | regressions --------------------------+--------+---------------+----------+------------------------------+------------ asus-C523NA-A20057-coral | x86_64 | lab-collabora | gcc-10 | x86_64_defcon...6-chromebook | 1 Details:
https://kernelci.org/test/plan/id/624274e680f31653c3ae0697
Results: 0 PASS, 1 FAIL, 0 SKIP Full config: x86_64_defconfig+x86-chromebook Compiler: gcc-10 (gcc (Debian 10.2.1-6) 10.2.1 20210110) Plain log:
https://storage.kernelci.org//next/pending-fixes/v5.17-12935-gafa5b5041c02/…
HTML log:
https://storage.kernelci.org//next/pending-fixes/v5.17-12935-gafa5b5041c02/…
Rootfs:
http://storage.kernelci.org/images/rootfs/buildroot/buildroot-baseline/2022…
* baseline.login:
https://kernelci.org/test/case/id/624274e680f31653c3ae0698
failing since 13 days (last pass: v5.17-rc7-200-gfb8a41b34095, first fail: v5.17-rc8-122-ge6f79dd905ae) platform | arch | lab | compiler | defconfig | regressions --------------------------+--------+---------------+----------+------------------------------+------------ hp-x360-12b-n4000-octopus | x86_64 | lab-collabora | gcc-10 | x86_64_defcon...ebook+amdgpu | 1 Details:
https://kernelci.org/test/plan/id/6242829b183fc10fccae0687
Results: 0 PASS, 1 FAIL, 0 SKIP Full config: x86_64_defconfig+x86-chromebook+amdgpu Compiler: gcc-10 (gcc (Debian 10.2.1-6) 10.2.1 20210110) Plain log:
https://storage.kernelci.org//next/pending-fixes/v5.17-12935-gafa5b5041c02/…
HTML log:
https://storage.kernelci.org//next/pending-fixes/v5.17-12935-gafa5b5041c02/…
Rootfs:
http://storage.kernelci.org/images/rootfs/buildroot/buildroot-baseline/2022…
* baseline.login:
https://kernelci.org/test/case/id/6242829b183fc10fccae0688
failing since 14 days (last pass: v5.17-rc7-220-g483b57a0f972, first fail: v5.17-rc8-96-g702087d7e205) platform | arch | lab | compiler | defconfig | regressions --------------------------+--------+---------------+----------+------------------------------+------------ hp-x360-12b-n4000-octopus | x86_64 | lab-collabora | gcc-10 | x86_64_defcon...6-chromebook | 1 Details:
https://kernelci.org/test/plan/id/624286317f2d8c9ff7ae06cd
Results: 0 PASS, 1 FAIL, 0 SKIP Full config: x86_64_defconfig+x86-chromebook Compiler: gcc-10 (gcc (Debian 10.2.1-6) 10.2.1 20210110) Plain log:
https://storage.kernelci.org//next/pending-fixes/v5.17-12935-gafa5b5041c02/…
HTML log:
https://storage.kernelci.org//next/pending-fixes/v5.17-12935-gafa5b5041c02/…
Rootfs:
http://storage.kernelci.org/images/rootfs/buildroot/buildroot-baseline/2022…
* baseline.login:
https://kernelci.org/test/case/id/624286317f2d8c9ff7ae06ce
failing since 13 days (last pass: v5.17-rc7-200-gfb8a41b34095, first fail: v5.17-rc8-122-ge6f79dd905ae) platform | arch | lab | compiler | defconfig | regressions --------------------------+--------+---------------+----------+------------------------------+------------ sun50i-a64-bananapi-m64 | arm64 | lab-clabbe | gcc-10 | defconfig+CON...OMIZE_BASE=y | 1 Details:
https://kernelci.org/test/plan/id/624262be3da276f7ebae067c
Results: 0 PASS, 1 FAIL, 0 SKIP Full config: defconfig+CONFIG_RANDOMIZE_BASE=y Compiler: gcc-10 (aarch64-linux-gnu-gcc (Debian 10.2.1-6) 10.2.1 20210110) Plain log:
https://storage.kernelci.org//next/pending-fixes/v5.17-12935-gafa5b5041c02/…
HTML log:
https://storage.kernelci.org//next/pending-fixes/v5.17-12935-gafa5b5041c02/…
Rootfs:
http://storage.kernelci.org/images/rootfs/buildroot/buildroot-baseline/2022…
* baseline.login:
https://kernelci.org/test/case/id/624262be3da276f7ebae067d
new failure (last pass: v5.17-11526-gd877adea8dd9)
3 years
1
0
0
0
← Newer
1
...
7
8
9
10
11
12
13
...
98
Older →
Jump to page:
1
2
3
4
5
6
7
8
9
10
11
12
13
14
15
16
17
18
19
20
21
22
23
24
25
26
27
28
29
30
31
32
33
34
35
36
37
38
39
40
41
42
43
44
45
46
47
48
49
50
51
52
53
54
55
56
57
58
59
60
61
62
63
64
65
66
67
68
69
70
71
72
73
74
75
76
77
78
79
80
81
82
83
84
85
86
87
88
89
90
91
92
93
94
95
96
97
98
Results per page:
10
25
50
100
200