mainline/master build: 27 builds: 2 failed, 25 passed, 5 errors, 4 warnings (v6.5-rc2-371-g269f4a4b85a1b)
Full Build Summary: https://kernelci.org/build/mainline/branch/master/kernel/v6.5-rc2-371-g269f4...
Tree: mainline Branch: master Git Describe: v6.5-rc2-371-g269f4a4b85a1b Git Commit: 269f4a4b85a1b61e94bf935b30c56a938e92f585 Git URL: https://git.kernel.org/pub/scm/linux/kernel/git/torvalds/linux.git Built: 7 unique architectures
Build Failures Detected:
arm: aspeed_g5_defconfig: (clang-11) FAIL rpc_defconfig: (gcc-10) FAIL
Errors and Warnings Detected:
arc:
arm: aspeed_g5_defconfig (clang-11): 3 errors rpc_defconfig (gcc-10): 2 errors
i386:
mips:
riscv:
sparc: sparc64_defconfig (gcc-10): 4 warnings
x86_64:
Errors summary:
3 clang: error: argument unused during compilation: '-Wa,-march=armv6k' [-Werror,-Wunused-command-line-argument] 1 arch/arm/kernel/head.S:319: Error: missing expression -- `ldr r7,=0x' 1 arch/arm/kernel/head.S:319: Error: missing expression -- `ldr r3,=0x'
Warnings summary:
2 WARNING: modpost: EXPORT symbol "_mcount" [vmlinux] version generation failed, symbol will not be versioned. 2 <stdin>:1519:2: warning: #warning syscall clone3 not implemented [-Wcpp]
================================================================================
Detailed per-defconfig build reports:
-------------------------------------------------------------------------------- allnoconfig (i386, gcc-10) — PASS, 0 errors, 0 warnings, 0 section mismatches
-------------------------------------------------------------------------------- aspeed_g5_defconfig (arm, clang-11) — FAIL, 3 errors, 0 warnings, 0 section mismatches
Errors: clang: error: argument unused during compilation: '-Wa,-march=armv6k' [-Werror,-Wunused-command-line-argument] clang: error: argument unused during compilation: '-Wa,-march=armv6k' [-Werror,-Wunused-command-line-argument] clang: error: argument unused during compilation: '-Wa,-march=armv6k' [-Werror,-Wunused-command-line-argument]
-------------------------------------------------------------------------------- defconfig (riscv, clang-16) — PASS, 0 errors, 0 warnings, 0 section mismatches
-------------------------------------------------------------------------------- fuloong2e_defconfig (mips, gcc-10) — PASS, 0 errors, 0 warnings, 0 section mismatches
-------------------------------------------------------------------------------- gemini_defconfig (arm, gcc-10) — PASS, 0 errors, 0 warnings, 0 section mismatches
-------------------------------------------------------------------------------- hisi_defconfig (arm, gcc-10) — PASS, 0 errors, 0 warnings, 0 section mismatches
-------------------------------------------------------------------------------- i386_defconfig (i386, clang-16) — PASS, 0 errors, 0 warnings, 0 section mismatches
-------------------------------------------------------------------------------- ip22_defconfig (mips, gcc-10) — PASS, 0 errors, 0 warnings, 0 section mismatches
-------------------------------------------------------------------------------- ip27_defconfig (mips, gcc-10) — PASS, 0 errors, 0 warnings, 0 section mismatches
-------------------------------------------------------------------------------- ip32_defconfig (mips, gcc-10) — PASS, 0 errors, 0 warnings, 0 section mismatches
-------------------------------------------------------------------------------- keystone_defconfig (arm, gcc-10) — PASS, 0 errors, 0 warnings, 0 section mismatches
-------------------------------------------------------------------------------- mps2_defconfig (arm, gcc-10) — PASS, 0 errors, 0 warnings, 0 section mismatches
-------------------------------------------------------------------------------- nommu_k210_sdcard_defconfig (riscv, gcc-10) — PASS, 0 errors, 0 warnings, 0 section mismatches
-------------------------------------------------------------------------------- nsimosci_hs_defconfig (arc, gcc-10) — PASS, 0 errors, 0 warnings, 0 section mismatches
-------------------------------------------------------------------------------- pxa910_defconfig (arm, gcc-10) — PASS, 0 errors, 0 warnings, 0 section mismatches
-------------------------------------------------------------------------------- rbtx49xx_defconfig (mips, gcc-10) — PASS, 0 errors, 0 warnings, 0 section mismatches
-------------------------------------------------------------------------------- rpc_defconfig (arm, gcc-10) — FAIL, 2 errors, 0 warnings, 0 section mismatches
Errors: arch/arm/kernel/head.S:319: Error: missing expression -- `ldr r7,=0x' arch/arm/kernel/head.S:319: Error: missing expression -- `ldr r3,=0x'
-------------------------------------------------------------------------------- rt305x_defconfig (mips, gcc-10) — PASS, 0 errors, 0 warnings, 0 section mismatches
-------------------------------------------------------------------------------- s3c6400_defconfig (arm, gcc-10) — PASS, 0 errors, 0 warnings, 0 section mismatches
-------------------------------------------------------------------------------- sama5_defconfig (arm, gcc-10) — PASS, 0 errors, 0 warnings, 0 section mismatches
-------------------------------------------------------------------------------- sparc64_defconfig (sparc, gcc-10) — PASS, 0 errors, 4 warnings, 0 section mismatches
Warnings: <stdin>:1519:2: warning: #warning syscall clone3 not implemented [-Wcpp] WARNING: modpost: EXPORT symbol "_mcount" [vmlinux] version generation failed, symbol will not be versioned. <stdin>:1519:2: warning: #warning syscall clone3 not implemented [-Wcpp] WARNING: modpost: EXPORT symbol "_mcount" [vmlinux] version generation failed, symbol will not be versioned.
-------------------------------------------------------------------------------- spear3xx_defconfig (arm, gcc-10) — PASS, 0 errors, 0 warnings, 0 section mismatches
-------------------------------------------------------------------------------- sunxi_defconfig (arm, gcc-10) — PASS, 0 errors, 0 warnings, 0 section mismatches
-------------------------------------------------------------------------------- u8500_defconfig (arm, gcc-10) — PASS, 0 errors, 0 warnings, 0 section mismatches
-------------------------------------------------------------------------------- x86_64_defconfig (x86_64, rustc-1.62) — PASS, 0 errors, 0 warnings, 0 section mismatches
-------------------------------------------------------------------------------- x86_64_defconfig (x86_64, gcc-10) — PASS, 0 errors, 0 warnings, 0 section mismatches
-------------------------------------------------------------------------------- x86_64_defconfig+rust-samples (x86_64, rustc-1.62) — PASS, 0 errors, 0 warnings, 0 section mismatches
--- For more info write to info@kernelci.org