Tree/Branch: next Git describe: next-20140520 Failed boot tests (console logs at the end) =========================================== legacy,dm365evm: FAIL: arm-davinci_all_defconfig da850-evm: FAIL: arm-davinci_all_defconfig sun7i-a20-cubieboard2: OFFLINE: arm-multi_v7_defconfig+CONFIG_ARM_LPAE=y
Full Report ===========
arm-davinci_all_defconfig ------------------------- legacy,dm365evm 0 min 15.9 sec: FAIL da850-evm 0 min 14.2 sec: FAIL
arm-tegra_defconfig ------------------- tegra124-jetson-tk1 0 min 21.5 sec: PASS tegra30-beaver 0 min 17.4 sec: PASS
arm-multi_v7_defconfig+CONFIG_ARM_LPAE=y ---------------------------------------- tegra124-jetson-tk1 0 min 21.3 sec: PASS armada-xp-openblocks-ax3-4 0 min 25.3 sec: PASS omap5-uevm 1 min 34.2 sec: PASS sun7i-a20-cubieboard2 0 min 31.4 sec: OFFLINE
arm-imx_v6_v7_defconfig ----------------------- imx6dl-wandboard,wand-dual 0 min 19.3 sec: PASS imx6dl-wandboard,wand-solo 0 min 18.7 sec: PASS imx6q-wandboard 0 min 17.3 sec: PASS
arm-omap2plus_defconfig ----------------------- legacy,3730xm 0 min 53.5 sec: PASS am335x-boneblack 0 min 25.7 sec: PASS omap3-beagle-xm 1 min 0.8 sec: PASS legacy,3530beagle 0 min 36.0 sec: PASS (Warnings: 1) omap4-panda 1 min 6.2 sec: PASS omap3-overo-tobi 0 min 23.1 sec: PASS (Warnings: 1) am335x-bone 0 min 27.4 sec: PASS omap3-overo-storm-tobi 0 min 24.7 sec: PASS omap5-uevm 1 min 0.5 sec: PASS omap3-n900 0 min 17.4 sec: PASS (Warnings: 1) legacy,n900 0 min 17.0 sec: PASS (Warnings: 1) omap4-panda-es 1 min 7.2 sec: PASS legacy,3730storm 0 min 22.7 sec: PASS legacy,3530overo 0 min 21.2 sec: PASS (Warnings: 1)
arm-multi_v7_defconfig ---------------------- qcom-apq8074-dragonboard 0 min 17.2 sec: PASS ste-snowball 1 min 21.2 sec: PASS tegra30-beaver 0 min 17.3 sec: PASS am335x-boneblack 0 min 24.1 sec: PASS omap3-beagle-xm 0 min 51.8 sec: PASS sun7i-a20-cubieboard2 0 min 12.3 sec: PASS armada-370-mirabox 0 min 22.4 sec: PASS omap4-panda 0 min 56.5 sec: PASS armada-xp-openblocks-ax3-4 0 min 25.4 sec: PASS sun4i-a10-cubieboard 0 min 22.2 sec: PASS bcm28155-ap 0 min 26.0 sec: PASS omap3-overo-tobi 0 min 22.4 sec: PASS (Warnings: 1) imx6dl-wandboard,wand-solo 0 min 18.2 sec: PASS am335x-bone 0 min 32.0 sec: PASS omap3-overo-storm-tobi 0 min 23.9 sec: PASS omap5-uevm 1 min 34.8 sec: PASS omap3-n900 0 min 16.3 sec: PASS (Warnings: 1) imx6q-wandboard 0 min 22.4 sec: PASS omap4-panda-es 0 min 58.1 sec: PASS imx6dl-wandboard,wand-dual 0 min 18.2 sec: PASS tegra124-jetson-tk1 0 min 21.3 sec: PASS
arm-sunxi_defconfig ------------------- sun7i-a20-cubieboard2 0 min 10.6 sec: PASS sun4i-a10-cubieboard 0 min 17.8 sec: PASS
arm-bcm_defconfig ----------------- bcm28155-ap 0 min 23.0 sec: PASS
arm-exynos_defconfig -------------------- exynos5420-arndale-octa 0 min 33.2 sec: PASS exynos5250-arndale 0 min 30.8 sec: PASS
arm-u8500_defconfig ------------------- ste-snowball 0 min 35.1 sec: PASS
arm-mvebu_v7_defconfig ---------------------- armada-xp-openblocks-ax3-4 0 min 22.6 sec: PASS armada-370-mirabox 0 min 20.7 sec: PASS
arm-sama5_defconfig ------------------- sama5d35ek 0 min 17.2 sec: PASS
Console logs for failures =========================
arm-davinci_all_defconfig -------------------------
legacy,dm365evm: FAIL: last 40 lines of boot log: -------------------------------------------------
[<c021b7a4>] (cpdma_ctlr_create) from [<c021965c>] (davinci_emac_probe+0x31c/0x5dc) r10:c7a584c0 r9:c0435c54 r8:c7a58508 r7:c04338d8 r6:c04338c8 r5:c04359a8 r4:c7a58000 [<c0219340>] (davinci_emac_probe) from [<c01fd4a4>] (platform_drv_probe+0x20/0x50) r10:c783c000 r9:00000000 r8:00000001 r7:c0457a10 r6:00000000 r5:c0457a10 r4:c04338d8 [<c01fd484>] (platform_drv_probe) from [<c01fbe50>] (driver_probe_device+0x118/0x240) r5:c04841d0 r4:c04338d8 [<c01fbd38>] (driver_probe_device) from [<c01fc00c>] (__driver_attach+0x94/0x98) r8:c040d9b4 r7:00000000 r6:c043390c r5:c0457a10 r4:c04338d8 r3:00000000 [<c01fbf78>] (__driver_attach) from [<c01fa42c>] (bus_for_each_dev+0x60/0x90) r6:c01fbf78 r5:c0457a10 r4:00000000 r3:00000000 [<c01fa3cc>] (bus_for_each_dev) from [<c01fb940>] (driver_attach+0x20/0x28) r6:c0456aa8 r5:c7b84780 r4:c0457a10 [<c01fb920>] (driver_attach) from [<c01fb548>] (bus_add_driver+0xdc/0x1dc) [<c01fb46c>] (bus_add_driver) from [<c01fc6f0>] (driver_register+0x80/0xfc) r7:c03f656c r6:c7bb7940 r5:c0428b78 r4:c0457a10 [<c01fc670>] (driver_register) from [<c01fd3b8>] (__platform_driver_register+0x50/0x64) r5:c0428b78 r4:c0428b78 [<c01fd368>] (__platform_driver_register) from [<c040d9cc>] (davinci_emac_init+0x18/0x20) [<c040d9b4>] (davinci_emac_init) from [<c0008934>] (do_one_initcall+0x88/0x1e0) [<c00088ac>] (do_one_initcall) from [<c03f6d34>] (kernel_init_freeable+0xf4/0x1bc) r10:0000004f r9:c0416c10 r8:c0416c18 r6:c045efc0 r5:00000007 r4:c041dd8c [<c03f6c40>] (kernel_init_freeable) from [<c02f8214>] (kernel_init+0x10/0xf4) r10:00000000 r9:00000000 r8:00000000 r7:00000000 r6:00000000 r5:c02f8204 r4:00000000 [<c02f8204>] (kernel_init) from [<c0009770>] (ret_from_fork+0x14/0x24) r4:00000000 r3:00000000 Code: e5903140 e2802f4f e5801140 e881000c (e5831000) ---[ end trace 30c48bb2c7d6fe96 ]--- note: swapper[1] exited with preempt_count 1 Kernel panic - not syncing: Attempted to kill init! exitcode=0x0000000b
---[ end Kernel panic - not syncing: Attempted to kill init! exitcode=0x0000000b
~$off # PYBOOT: Exception: kernel: Unable to handle kernel NULL pointer dereference at virtual address 00000000
# PYBOOT: Time: 15.92 seconds. # PYBOOT: Result: FAIL
da850-evm: FAIL: last 40 lines of boot log: -------------------------------------------
[<c021b7a4>] (cpdma_ctlr_create) from [<c021965c>] (davinci_emac_probe+0x31c/0x5dc) r10:c79194c0 r9:c7831b40 r8:c7919508 r7:c7885610 r6:c7885600 r5:c7b65810 r4:c7919000 [<c0219340>] (davinci_emac_probe) from [<c01fd4a4>] (platform_drv_probe+0x20/0x50) r10:c783c000 r9:00000000 r8:00000004 r7:c0457a10 r6:00000000 r5:c0457a10 r4:c7885610 [<c01fd484>] (platform_drv_probe) from [<c01fbe50>] (driver_probe_device+0x118/0x240) r5:c04841d0 r4:c7885610 [<c01fbd38>] (driver_probe_device) from [<c01fc00c>] (__driver_attach+0x94/0x98) r8:c040d9b4 r7:00000000 r6:c7885644 r5:c0457a10 r4:c7885610 r3:00000000 [<c01fbf78>] (__driver_attach) from [<c01fa42c>] (bus_for_each_dev+0x60/0x90) r6:c01fbf78 r5:c0457a10 r4:00000000 r3:00000000 [<c01fa3cc>] (bus_for_each_dev) from [<c01fb940>] (driver_attach+0x20/0x28) r6:c0456aa8 r5:c7bbe9c0 r4:c0457a10 [<c01fb920>] (driver_attach) from [<c01fb548>] (bus_add_driver+0xdc/0x1dc) [<c01fb46c>] (bus_add_driver) from [<c01fc6f0>] (driver_register+0x80/0xfc) r7:c03f656c r6:c7bc8b80 r5:c0428b78 r4:c0457a10 [<c01fc670>] (driver_register) from [<c01fd3b8>] (__platform_driver_register+0x50/0x64) r5:c0428b78 r4:c0428b78 [<c01fd368>] (__platform_driver_register) from [<c040d9cc>] (davinci_emac_init+0x18/0x20) [<c040d9b4>] (davinci_emac_init) from [<c0008934>] (do_one_initcall+0x88/0x1e0) [<c00088ac>] (do_one_initcall) from [<c03f6d34>] (kernel_init_freeable+0xf4/0x1bc) r10:0000004f r9:c0416c10 r8:c0416c18 r6:c045efc0 r5:00000007 r4:c041dd8c [<c03f6c40>] (kernel_init_freeable) from [<c02f8214>] (kernel_init+0x10/0xf4) r10:00000000 r9:00000000 r8:00000000 r7:00000000 r6:00000000 r5:c02f8204 r4:00000000 [<c02f8204>] (kernel_init) from [<c0009770>] (ret_from_fork+0x14/0x24) r4:00000000 r3:00000000 Code: e5903140 e2802f4f e5801140 e881000c (e5831000) ---[ end trace 496b6c892cfe61cd ]--- note: swapper[1] exited with preempt_count 1 Kernel panic - not syncing: Attempted to kill init! exitcode=0x0000000b
---[ end Kernel panic - not syncing: Attempted to kill init! exitcode=0x0000000b
~$off # PYBOOT: Exception: kernel: Unable to handle kernel NULL pointer dereference at virtual address 00000000
# PYBOOT: Time: 14.23 seconds. # PYBOOT: Result: FAIL
arm-multi_v7_defconfig+CONFIG_ARM_LPAE=y ----------------------------------------
sun7i-a20-cubieboard2: OFFLINE: last 40 lines of boot log: ----------------------------------------------------------
Connected to cubie2 console [channel connected] (~$quit to exit) (user:khilman) is already connected
~$hardreset
Command(cubie2 console)> hardreset (user:khilman) Reboot cubie2 Reboot: cubie2 ; phidget 3 0 : off, sleep, on 0 sun7i# ~$off # PYBOOT: Exception: ('ERROR: Could not break into u-boot.', 'OFFLINE') # PYBOOT: Time: 31.40 seconds. # PYBOOT: Result: OFFLINE