stable-rc/linux-6.1.y build: 20 builds: 2 failed, 18 passed, 18 errors, 7 warnings (v6.1.88)
Full Build Summary: https://kernelci.org/build/stable-rc/branch/linux-6.1.y/kernel/v6.1.88/
Tree: stable-rc Branch: linux-6.1.y Git Describe: v6.1.88 Git Commit: f2295faba5e8249ae4082791bfc1664c88fff83a Git URL: https://git.kernel.org/pub/scm/linux/kernel/git/stable/linux-stable-rc.git Built: 7 unique architectures
Build Failures Detected:
arm: multi_v7_defconfig: (gcc-10) FAIL omap2plus_defconfig: (gcc-10) FAIL
Errors and Warnings Detected:
arc:
arm64:
arm: multi_v7_defconfig (gcc-10): 9 errors, 3 warnings omap2plus_defconfig (gcc-10): 9 errors, 3 warnings
i386:
mips: 32r2el_defconfig (gcc-10): 1 warning
riscv:
x86_64:
Errors summary:
2 arch/arm/mach-omap2/pdata-quirks.c:272:2: error: implicit declaration of function ‘gpiod_add_lookup_table’ [-Werror=implicit-function-declaration] 2 arch/arm/mach-omap2/pdata-quirks.c:265:3: error: extra brace group at end of initializer 2 arch/arm/mach-omap2/pdata-quirks.c:263:41: error: ‘GPIO_ACTIVE_HIGH’ undeclared here (not in a function); did you mean ‘ACPI_ACTIVE_HIGH’? 2 arch/arm/mach-omap2/pdata-quirks.c:263:3: error: implicit declaration of function ‘GPIO_LOOKUP’; did you mean ‘IOP_LOOKUP’? [-Werror=implicit-function-declaration] 2 arch/arm/mach-omap2/pdata-quirks.c:262:3: error: ‘struct gpiod_lookup_table’ has no member named ‘table’ 2 arch/arm/mach-omap2/pdata-quirks.c:262:11: error: extra brace group at end of initializer 2 arch/arm/mach-omap2/pdata-quirks.c:261:3: error: ‘struct gpiod_lookup_table’ has no member named ‘dev_id’ 2 arch/arm/mach-omap2/pdata-quirks.c:260:34: error: storage size of ‘pandora_soc_audio_gpios’ isn’t known 2 arch/arm/mach-omap2/pdata-quirks.c:260:15: error: variable ‘pandora_soc_audio_gpios’ has initializer but incomplete type
Warnings summary:
2 cc1: some warnings being treated as errors 2 arch/arm/mach-omap2/pdata-quirks.c:262:11: warning: excess elements in struct initializer 2 arch/arm/mach-omap2/pdata-quirks.c:261:12: warning: excess elements in struct initializer 1 arch/mips/boot/dts/img/boston.dts:128.19-178.5: Warning (pci_device_reg): /pci@14000000/pci2_root@0,0,0: PCI unit address format error, expected "0,0"
================================================================================
Detailed per-defconfig build reports:
-------------------------------------------------------------------------------- 32r2el_defconfig (mips, gcc-10) — PASS, 0 errors, 1 warning, 0 section mismatches
Warnings: arch/mips/boot/dts/img/boston.dts:128.19-178.5: Warning (pci_device_reg): /pci@14000000/pci2_root@0,0,0: PCI unit address format error, expected "0,0"
-------------------------------------------------------------------------------- allnoconfig (x86_64, gcc-10) — PASS, 0 errors, 0 warnings, 0 section mismatches
-------------------------------------------------------------------------------- allnoconfig (i386, gcc-10) — PASS, 0 errors, 0 warnings, 0 section mismatches
-------------------------------------------------------------------------------- defconfig (riscv, gcc-10) — PASS, 0 errors, 0 warnings, 0 section mismatches
-------------------------------------------------------------------------------- defconfig (arm64, gcc-10) — PASS, 0 errors, 0 warnings, 0 section mismatches
-------------------------------------------------------------------------------- defconfig+arm64-chromebook (arm64, gcc-10) — PASS, 0 errors, 0 warnings, 0 section mismatches
-------------------------------------------------------------------------------- haps_hs_smp_defconfig (arc, gcc-10) — PASS, 0 errors, 0 warnings, 0 section mismatches
-------------------------------------------------------------------------------- i386_defconfig (i386, gcc-10) — PASS, 0 errors, 0 warnings, 0 section mismatches
-------------------------------------------------------------------------------- imx_v6_v7_defconfig (arm, gcc-10) — PASS, 0 errors, 0 warnings, 0 section mismatches
-------------------------------------------------------------------------------- multi_v5_defconfig (arm, gcc-10) — PASS, 0 errors, 0 warnings, 0 section mismatches
-------------------------------------------------------------------------------- multi_v7_defconfig (arm, gcc-10) — FAIL, 9 errors, 3 warnings, 0 section mismatches
Errors: arch/arm/mach-omap2/pdata-quirks.c:260:15: error: variable ‘pandora_soc_audio_gpios’ has initializer but incomplete type arch/arm/mach-omap2/pdata-quirks.c:261:3: error: ‘struct gpiod_lookup_table’ has no member named ‘dev_id’ arch/arm/mach-omap2/pdata-quirks.c:262:3: error: ‘struct gpiod_lookup_table’ has no member named ‘table’ arch/arm/mach-omap2/pdata-quirks.c:262:11: error: extra brace group at end of initializer arch/arm/mach-omap2/pdata-quirks.c:263:3: error: implicit declaration of function ‘GPIO_LOOKUP’; did you mean ‘IOP_LOOKUP’? [-Werror=implicit-function-declaration] arch/arm/mach-omap2/pdata-quirks.c:263:41: error: ‘GPIO_ACTIVE_HIGH’ undeclared here (not in a function); did you mean ‘ACPI_ACTIVE_HIGH’? arch/arm/mach-omap2/pdata-quirks.c:265:3: error: extra brace group at end of initializer arch/arm/mach-omap2/pdata-quirks.c:272:2: error: implicit declaration of function ‘gpiod_add_lookup_table’ [-Werror=implicit-function-declaration] arch/arm/mach-omap2/pdata-quirks.c:260:34: error: storage size of ‘pandora_soc_audio_gpios’ isn’t known
Warnings: arch/arm/mach-omap2/pdata-quirks.c:261:12: warning: excess elements in struct initializer arch/arm/mach-omap2/pdata-quirks.c:262:11: warning: excess elements in struct initializer cc1: some warnings being treated as errors
-------------------------------------------------------------------------------- nommu_k210_defconfig (riscv, gcc-10) — PASS, 0 errors, 0 warnings, 0 section mismatches
-------------------------------------------------------------------------------- nommu_k210_sdcard_defconfig (riscv, gcc-10) — PASS, 0 errors, 0 warnings, 0 section mismatches
-------------------------------------------------------------------------------- omap2plus_defconfig (arm, gcc-10) — FAIL, 9 errors, 3 warnings, 0 section mismatches
Errors: arch/arm/mach-omap2/pdata-quirks.c:260:15: error: variable ‘pandora_soc_audio_gpios’ has initializer but incomplete type arch/arm/mach-omap2/pdata-quirks.c:261:3: error: ‘struct gpiod_lookup_table’ has no member named ‘dev_id’ arch/arm/mach-omap2/pdata-quirks.c:262:3: error: ‘struct gpiod_lookup_table’ has no member named ‘table’ arch/arm/mach-omap2/pdata-quirks.c:262:11: error: extra brace group at end of initializer arch/arm/mach-omap2/pdata-quirks.c:263:3: error: implicit declaration of function ‘GPIO_LOOKUP’; did you mean ‘IOP_LOOKUP’? [-Werror=implicit-function-declaration] arch/arm/mach-omap2/pdata-quirks.c:263:41: error: ‘GPIO_ACTIVE_HIGH’ undeclared here (not in a function); did you mean ‘ACPI_ACTIVE_HIGH’? arch/arm/mach-omap2/pdata-quirks.c:265:3: error: extra brace group at end of initializer arch/arm/mach-omap2/pdata-quirks.c:272:2: error: implicit declaration of function ‘gpiod_add_lookup_table’ [-Werror=implicit-function-declaration] arch/arm/mach-omap2/pdata-quirks.c:260:34: error: storage size of ‘pandora_soc_audio_gpios’ isn’t known
Warnings: arch/arm/mach-omap2/pdata-quirks.c:261:12: warning: excess elements in struct initializer arch/arm/mach-omap2/pdata-quirks.c:262:11: warning: excess elements in struct initializer cc1: some warnings being treated as errors
-------------------------------------------------------------------------------- rv32_defconfig (riscv, gcc-10) — PASS, 0 errors, 0 warnings, 0 section mismatches
-------------------------------------------------------------------------------- tinyconfig (x86_64, gcc-10) — PASS, 0 errors, 0 warnings, 0 section mismatches
-------------------------------------------------------------------------------- tinyconfig (i386, gcc-10) — PASS, 0 errors, 0 warnings, 0 section mismatches
-------------------------------------------------------------------------------- vexpress_defconfig (arm, gcc-10) — PASS, 0 errors, 0 warnings, 0 section mismatches
-------------------------------------------------------------------------------- x86_64_defconfig (x86_64, gcc-10) — PASS, 0 errors, 0 warnings, 0 section mismatches
-------------------------------------------------------------------------------- x86_64_defconfig+x86-board (x86_64, gcc-10) — PASS, 0 errors, 0 warnings, 0 section mismatches
--- For more info write to info@kernelci.org
kernel-build-reports@lists.linaro.org